Tue Aug 11 18:18:35 2026 ===  0.000000 === build starting
Tue Aug 11 18:18:35 2026 ===  0.000071 === version 20190516
Tue Aug 11 18:18:35 2026 ===  0.000032 === hostname pkgsrchostname
Tue Aug 11 18:18:35 2026 ===  0.000232 === compilers/abiname.c compiling gcc -fPIC -Wall -fomit-frame-pointer -fwrapv -O3
Tue Aug 11 18:18:35 2026 ===  0.280448 === compilers/abiname.c compiling gcc -fPIC -Wall -fomit-frame-pointer -fwrapv -march=core-avx2 -O3
Tue Aug 11 18:18:35 2026 ===  0.087416 === compilers/abiname.c compiling clang -fPIC -Wall -fomit-frame-pointer -fwrapv -Qunused-arguments -O3
Tue Aug 11 18:18:35 2026 ===  0.033807 === output
> gcc: error: unrecognized command-line option ‘-Qunused-arguments’
Tue Aug 11 18:18:35 2026 ===  0.000411 === compilers/abiname.c compiler exited 1
Tue Aug 11 18:18:35 2026 ===  0.033246 === output
> gcc: error: unrecognized command-line option ‘-Qunused-arguments’
Tue Aug 11 18:18:35 2026 ===  0.000373 === compilers/base.c compiler exited 1
Tue Aug 11 18:18:35 2026 ===  0.007361 === compilers/abiname.c compiling clang -fPIC -Wall -fomit-frame-pointer -fwrapv -Qunused-arguments -mavx2 -O3
Tue Aug 11 18:18:35 2026 ===  0.033385 === output
> gcc: error: unrecognized command-line option ‘-Qunused-arguments’
Tue Aug 11 18:18:35 2026 ===  0.000441 === compilers/abiname.c compiler exited 1
Tue Aug 11 18:18:35 2026 ===  0.033589 === output
> gcc: error: unrecognized command-line option ‘-Qunused-arguments’
Tue Aug 11 18:18:35 2026 ===  0.000370 === compilers/base.c compiler exited 1
Tue Aug 11 18:18:35 2026 ===  0.007641 === cpucycles/amd64cpuinfo compiling gcc -fPIC -Wall -fomit-frame-pointer -fwrapv -O3
Tue Aug 11 18:18:35 2026 ===  0.058911 === output
> cpucycles.c: In function ‘djbsort_cpucycles’:
> cpucycles.c:10:3: error: inconsistent operand constraints in an ‘asm’
>    10 |   asm volatile(".byte 15;.byte 49;shlq $32,%%rdx;orq %%rdx,%%rax"
>       |   ^~~
Tue Aug 11 18:18:35 2026 ===  0.000475 === cpucycles/cpucycles.c compiler exited 1
Tue Aug 11 18:18:35 2026 ===  0.000101 === cpucycles/amd64cpuinfo compiling gcc -fPIC -Wall -fomit-frame-pointer -fwrapv -march=core-avx2 -O3
Tue Aug 11 18:18:35 2026 ===  0.060525 === output
> cpucycles.c: In function ‘djbsort_cpucycles’:
> cpucycles.c:10:3: error: inconsistent operand constraints in an ‘asm’
>    10 |   asm volatile(".byte 15;.byte 49;shlq $32,%%rdx;orq %%rdx,%%rax"
>       |   ^~~
Tue Aug 11 18:18:35 2026 ===  0.000471 === cpucycles/cpucycles.c compiler exited 1
Tue Aug 11 18:18:35 2026 ===  0.000098 === cpucycles/amd64cpuinfo compiling clang -fPIC -Wall -fomit-frame-pointer -fwrapv -Qunused-arguments -O3
Tue Aug 11 18:18:35 2026 ===  0.034148 === output
> gcc: error: unrecognized command-line option ‘-Qunused-arguments’
Tue Aug 11 18:18:35 2026 ===  0.000523 === cpucycles/cpucycles.c compiler exited 1
Tue Aug 11 18:18:35 2026 ===  0.000106 === cpucycles/amd64cpuinfo compiling clang -fPIC -Wall -fomit-frame-pointer -fwrapv -Qunused-arguments -mavx2 -O3
Tue Aug 11 18:18:35 2026 ===  0.033642 === output
> gcc: error: unrecognized command-line option ‘-Qunused-arguments’
Tue Aug 11 18:18:35 2026 ===  0.000418 === cpucycles/cpucycles.c compiler exited 1
Tue Aug 11 18:18:35 2026 ===  0.000148 === cpucycles/amd64cpuspeed compiling gcc -fPIC -Wall -fomit-frame-pointer -fwrapv -O3
Tue Aug 11 18:18:36 2026 ===  0.040293 === output
> cpucycles.c: In function ‘djbsort_cpucycles_persecond’:
> cpucycles.c:21:12: error: ‘HW_CPUSPEED’ undeclared (first use in this function)
>    21 |   oid[1] = HW_CPUSPEED;
>       |            ^~~~~~~~~~~
> cpucycles.c:21:12: note: each undeclared identifier is reported only once for each function it appears in
Tue Aug 11 18:18:36 2026 ===  0.000424 === cpucycles/cpucycles.c compiler exited 1
Tue Aug 11 18:18:36 2026 ===  0.000104 === cpucycles/amd64cpuspeed compiling gcc -fPIC -Wall -fomit-frame-pointer -fwrapv -march=core-avx2 -O3
Tue Aug 11 18:18:36 2026 ===  0.038611 === output
> cpucycles.c: In function ‘djbsort_cpucycles_persecond’:
> cpucycles.c:21:12: error: ‘HW_CPUSPEED’ undeclared (first use in this function)
>    21 |   oid[1] = HW_CPUSPEED;
>       |            ^~~~~~~~~~~
> cpucycles.c:21:12: note: each undeclared identifier is reported only once for each function it appears in
Tue Aug 11 18:18:36 2026 ===  0.000452 === cpucycles/cpucycles.c compiler exited 1
Tue Aug 11 18:18:36 2026 ===  0.000108 === cpucycles/amd64cpuspeed compiling clang -fPIC -Wall -fomit-frame-pointer -fwrapv -Qunused-arguments -O3
Tue Aug 11 18:18:36 2026 ===  0.035433 === output
> gcc: error: unrecognized command-line option ‘-Qunused-arguments’
Tue Aug 11 18:18:36 2026 ===  0.000414 === cpucycles/cpucycles.c compiler exited 1
Tue Aug 11 18:18:36 2026 ===  0.000109 === cpucycles/amd64cpuspeed compiling clang -fPIC -Wall -fomit-frame-pointer -fwrapv -Qunused-arguments -mavx2 -O3
Tue Aug 11 18:18:36 2026 ===  0.032876 === output
> gcc: error: unrecognized command-line option ‘-Qunused-arguments’
Tue Aug 11 18:18:36 2026 ===  0.000436 === cpucycles/cpucycles.c compiler exited 1
Tue Aug 11 18:18:36 2026 ===  0.000148 === cpucycles/amd64tscfreq compiling gcc -fPIC -Wall -fomit-frame-pointer -fwrapv -O3
Tue Aug 11 18:18:36 2026 ===  0.043388 === output
> cpucycles.c: In function ‘djbsort_cpucycles_persecond’:
> cpucycles.c:17:3: warning: implicit declaration of function ‘sysctlbyname’ [-Wimplicit-function-declaration]
>    17 |   sysctlbyname("machdep.tsc_freq",&result,&resultlen,0,0);
>       |   ^~~~~~~~~~~~
> cpucycles.c: In function ‘djbsort_cpucycles’:
> cpucycles.c:8:3: error: inconsistent operand constraints in an ‘asm’
>     8 |   asm volatile(".byte 15;.byte 49;shlq $32,%%rdx;orq %%rdx,%%rax"
>       |   ^~~
Tue Aug 11 18:18:36 2026 ===  0.000441 === cpucycles/cpucycles.c compiler exited 1
Tue Aug 11 18:18:36 2026 ===  0.000094 === cpucycles/amd64tscfreq compiling gcc -fPIC -Wall -fomit-frame-pointer -fwrapv -march=core-avx2 -O3
Tue Aug 11 18:18:36 2026 ===  0.044797 === output
> cpucycles.c: In function ‘djbsort_cpucycles_persecond’:
> cpucycles.c:17:3: warning: implicit declaration of function ‘sysctlbyname’ [-Wimplicit-function-declaration]
>    17 |   sysctlbyname("machdep.tsc_freq",&result,&resultlen,0,0);
>       |   ^~~~~~~~~~~~
> cpucycles.c: In function ‘djbsort_cpucycles’:
> cpucycles.c:8:3: error: inconsistent operand constraints in an ‘asm’
>     8 |   asm volatile(".byte 15;.byte 49;shlq $32,%%rdx;orq %%rdx,%%rax"
>       |   ^~~
Tue Aug 11 18:18:36 2026 ===  0.000459 === cpucycles/cpucycles.c compiler exited 1
Tue Aug 11 18:18:36 2026 ===  0.000104 === cpucycles/amd64tscfreq compiling clang -fPIC -Wall -fomit-frame-pointer -fwrapv -Qunused-arguments -O3
Tue Aug 11 18:18:36 2026 ===  0.032770 === output
> gcc: error: unrecognized command-line option ‘-Qunused-arguments’
Tue Aug 11 18:18:36 2026 ===  0.000397 === cpucycles/cpucycles.c compiler exited 1
Tue Aug 11 18:18:36 2026 ===  0.000128 === cpucycles/amd64tscfreq compiling clang -fPIC -Wall -fomit-frame-pointer -fwrapv -Qunused-arguments -mavx2 -O3
Tue Aug 11 18:18:36 2026 ===  0.033402 === output
> gcc: error: unrecognized command-line option ‘-Qunused-arguments’
Tue Aug 11 18:18:36 2026 ===  0.000412 === cpucycles/cpucycles.c compiler exited 1
Tue Aug 11 18:18:36 2026 ===  0.000147 === cpucycles/apple compiling gcc -fPIC -Wall -fomit-frame-pointer -fwrapv -O3
Tue Aug 11 18:18:36 2026 ===  0.141892 === output
> cpucycles.c:6:10: fatal error: mach/mach_time.h: No such file or directory
>     6 | #include <mach/mach_time.h>
>       |          ^~~~~~~~~~~~~~~~~~
> compilation terminated.
Tue Aug 11 18:18:36 2026 ===  0.000403 === cpucycles/cpucycles.c compiler exited 1
Tue Aug 11 18:18:36 2026 ===  0.000077 === cpucycles/apple compiling gcc -fPIC -Wall -fomit-frame-pointer -fwrapv -march=core-avx2 -O3
Tue Aug 11 18:18:36 2026 ===  0.045961 === output
> cpucycles.c:6:10: fatal error: mach/mach_time.h: No such file or directory
>     6 | #include <mach/mach_time.h>
>       |          ^~~~~~~~~~~~~~~~~~
> compilation terminated.
Tue Aug 11 18:18:36 2026 ===  0.000402 === cpucycles/cpucycles.c compiler exited 1
Tue Aug 11 18:18:36 2026 ===  0.130183 === cpucycles/apple compiling clang -fPIC -Wall -fomit-frame-pointer -fwrapv -Qunused-arguments -O3
Tue Aug 11 18:18:36 2026 ===  0.032113 === output
> gcc: error: unrecognized command-line option ‘-Qunused-arguments’
Tue Aug 11 18:18:36 2026 ===  0.000366 === cpucycles/cpucycles.c compiler exited 1
Tue Aug 11 18:18:36 2026 ===  0.000091 === cpucycles/apple compiling clang -fPIC -Wall -fomit-frame-pointer -fwrapv -Qunused-arguments -mavx2 -O3
Tue Aug 11 18:18:36 2026 ===  0.031876 === output
> gcc: error: unrecognized command-line option ‘-Qunused-arguments’
Tue Aug 11 18:18:36 2026 ===  0.000403 === cpucycles/cpucycles.c compiler exited 1
Tue Aug 11 18:18:36 2026 ===  0.000124 === cpucycles/celllinux compiling gcc -fPIC -Wall -fomit-frame-pointer -fwrapv -O3
Tue Aug 11 18:18:36 2026 ===  0.091381 === output
> cpucycles.c:6:10: fatal error: spu_mfcio.h: No such file or directory
>     6 | #include <spu_mfcio.h>
>       |          ^~~~~~~~~~~~~
> compilation terminated.
Tue Aug 11 18:18:36 2026 ===  0.000397 === cpucycles/cpucycles.c compiler exited 1
Tue Aug 11 18:18:36 2026 ===  0.000103 === cpucycles/celllinux compiling gcc -fPIC -Wall -fomit-frame-pointer -fwrapv -march=core-avx2 -O3
Tue Aug 11 18:18:36 2026 ===  0.037948 === output
> cpucycles.c:6:10: fatal error: spu_mfcio.h: No such file or directory
>     6 | #include <spu_mfcio.h>
>       |          ^~~~~~~~~~~~~
> compilation terminated.
Tue Aug 11 18:18:36 2026 ===  0.000456 === cpucycles/cpucycles.c compiler exited 1
Tue Aug 11 18:18:36 2026 ===  0.000099 === cpucycles/celllinux compiling clang -fPIC -Wall -fomit-frame-pointer -fwrapv -Qunused-arguments -O3
Tue Aug 11 18:18:36 2026 ===  0.033594 === output
> gcc: error: unrecognized command-line option ‘-Qunused-arguments’
Tue Aug 11 18:18:36 2026 ===  0.000416 === cpucycles/cpucycles.c compiler exited 1
Tue Aug 11 18:18:36 2026 ===  0.000113 === cpucycles/celllinux compiling clang -fPIC -Wall -fomit-frame-pointer -fwrapv -Qunused-arguments -mavx2 -O3
Tue Aug 11 18:18:36 2026 ===  0.032680 === output
> gcc: error: unrecognized command-line option ‘-Qunused-arguments’
Tue Aug 11 18:18:36 2026 ===  0.000416 === cpucycles/cpucycles.c compiler exited 1
Tue Aug 11 18:18:36 2026 ===  0.000142 === cpucycles/cortex compiling gcc -fPIC -Wall -fomit-frame-pointer -fwrapv -O3
Tue Aug 11 18:18:37 2026 ===  0.613053 === output
> cpucycles.c: Assembler messages:
> cpucycles.c:59: Error: no such instruction: `mcr p15,0,%eax,c9,c12,0'
> cpucycles.c:60: Error: no such instruction: `mcr p15,0,%eax,c9,c12,1'
> cpucycles.c:61: Error: no such instruction: `mcr p15,0,%eax,c9,c12,3'
> cpucycles.c:64: Error: no such instruction: `mrc p15,0,%ecx,c9,c13,0'
Tue Aug 11 18:18:37 2026 ===  0.000396 === cpucycles/cpucycles.c compiler exited 1
Tue Aug 11 18:18:37 2026 ===  0.000102 === cpucycles/cortex compiling gcc -fPIC -Wall -fomit-frame-pointer -fwrapv -march=core-avx2 -O3
Tue Aug 11 18:18:37 2026 ===  0.094395 === output
> cpucycles.c: Assembler messages:
> cpucycles.c:59: Error: no such instruction: `mcr p15,0,%eax,c9,c12,0'
> cpucycles.c:60: Error: no such instruction: `mcr p15,0,%eax,c9,c12,1'
> cpucycles.c:61: Error: no such instruction: `mcr p15,0,%eax,c9,c12,3'
> cpucycles.c:64: Error: no such instruction: `mrc p15,0,%edi,c9,c13,0'
Tue Aug 11 18:18:37 2026 ===  0.000452 === cpucycles/cpucycles.c compiler exited 1
Tue Aug 11 18:18:37 2026 ===  0.000115 === cpucycles/cortex compiling clang -fPIC -Wall -fomit-frame-pointer -fwrapv -Qunused-arguments -O3
Tue Aug 11 18:18:37 2026 ===  0.035308 === output
> gcc: error: unrecognized command-line option ‘-Qunused-arguments’
Tue Aug 11 18:18:37 2026 ===  0.000418 === cpucycles/cpucycles.c compiler exited 1
Tue Aug 11 18:18:37 2026 ===  0.000105 === cpucycles/cortex compiling clang -fPIC -Wall -fomit-frame-pointer -fwrapv -Qunused-arguments -mavx2 -O3
Tue Aug 11 18:18:37 2026 ===  0.034956 === output
> gcc: error: unrecognized command-line option ‘-Qunused-arguments’
Tue Aug 11 18:18:37 2026 ===  0.000427 === cpucycles/cpucycles.c compiler exited 1
Tue Aug 11 18:18:37 2026 ===  0.000148 === cpucycles/cortex_vct compiling gcc -fPIC -Wall -fomit-frame-pointer -fwrapv -O3
Tue Aug 11 18:18:37 2026 ===  0.062042 === output
> cpucycles.c: In function ‘djbsort_cpucycles’:
> cpucycles.c:27:1: warning: unsupported size for integer register
>    27 | }
>       | ^
> cpucycles.c: In function ‘djbsort_cpucycles_persecond’:
> cpucycles.c:49:1: warning: unsupported size for integer register
>    49 | }
>       | ^
> cpucycles.c: Assembler messages:
> cpucycles.c:25: Error: no such instruction: `mrs %eax,CNTVCT_EL0'
> cpucycles.c:17: Error: no such instruction: `mrs %esi,CNTFRQ_EL0'
Tue Aug 11 18:18:37 2026 ===  0.000451 === cpucycles/cpucycles.c compiler exited 1
Tue Aug 11 18:18:37 2026 ===  0.000109 === cpucycles/cortex_vct compiling gcc -fPIC -Wall -fomit-frame-pointer -fwrapv -march=core-avx2 -O3
Tue Aug 11 18:18:37 2026 ===  0.122663 === output
> cpucycles.c: In function ‘djbsort_cpucycles’:
> cpucycles.c:27:1: warning: unsupported size for integer register
>    27 | }
>       | ^
> cpucycles.c: In function ‘djbsort_cpucycles_persecond’:
> cpucycles.c:49:1: warning: unsupported size for integer register
>    49 | }
>       | ^
> cpucycles.c: Assembler messages:
> cpucycles.c:25: Error: no such instruction: `mrs %eax,CNTVCT_EL0'
> cpucycles.c:17: Error: no such instruction: `mrs %eax,CNTFRQ_EL0'
Tue Aug 11 18:18:37 2026 ===  0.000395 === cpucycles/cpucycles.c compiler exited 1
Tue Aug 11 18:18:37 2026 ===  0.000086 === cpucycles/cortex_vct compiling clang -fPIC -Wall -fomit-frame-pointer -fwrapv -Qunused-arguments -O3
Tue Aug 11 18:18:37 2026 ===  0.033538 === output
> gcc: error: unrecognized command-line option ‘-Qunused-arguments’
Tue Aug 11 18:18:37 2026 ===  0.000410 === cpucycles/cpucycles.c compiler exited 1
Tue Aug 11 18:18:37 2026 ===  0.000102 === cpucycles/cortex_vct compiling clang -fPIC -Wall -fomit-frame-pointer -fwrapv -Qunused-arguments -mavx2 -O3
Tue Aug 11 18:18:37 2026 ===  0.033533 === output
> gcc: error: unrecognized command-line option ‘-Qunused-arguments’
Tue Aug 11 18:18:37 2026 ===  0.000430 === cpucycles/cpucycles.c compiler exited 1
Tue Aug 11 18:18:37 2026 ===  0.000158 === cpucycles/dev4ns compiling gcc -fPIC -Wall -fomit-frame-pointer -fwrapv -O3
Tue Aug 11 18:18:38 2026 ===  0.236847 === cpucycles/dev4ns compiling gcc -fPIC -Wall -fomit-frame-pointer -fwrapv -march=core-avx2 -O3
Tue Aug 11 18:18:38 2026 ===  0.270929 === cpucycles/dev4ns compiling clang -fPIC -Wall -fomit-frame-pointer -fwrapv -Qunused-arguments -O3
Tue Aug 11 18:18:38 2026 ===  0.033651 === output
> gcc: error: unrecognized command-line option ‘-Qunused-arguments’
Tue Aug 11 18:18:38 2026 ===  0.000392 === cpucycles/cpucycles.c compiler exited 1
Tue Aug 11 18:18:38 2026 ===  0.000120 === cpucycles/dev4ns compiling clang -fPIC -Wall -fomit-frame-pointer -fwrapv -Qunused-arguments -mavx2 -O3
Tue Aug 11 18:18:38 2026 ===  0.110647 === output
> gcc: error: unrecognized command-line option ‘-Qunused-arguments’
Tue Aug 11 18:18:38 2026 ===  0.000373 === cpucycles/cpucycles.c compiler exited 1
Tue Aug 11 18:18:38 2026 ===  0.000125 === cpucycles/gettimeofday compiling gcc -fPIC -Wall -fomit-frame-pointer -fwrapv -O3
Tue Aug 11 18:18:38 2026 ===  0.391755 === cpucycles/gettimeofday compiling gcc -fPIC -Wall -fomit-frame-pointer -fwrapv -march=core-avx2 -O3
Tue Aug 11 18:18:39 2026 ===  0.268343 === cpucycles/gettimeofday compiling clang -fPIC -Wall -fomit-frame-pointer -fwrapv -Qunused-arguments -O3
Tue Aug 11 18:18:39 2026 ===  0.034732 === output
> gcc: error: unrecognized command-line option ‘-Qunused-arguments’
Tue Aug 11 18:18:39 2026 ===  0.000391 === cpucycles/cpucycles.c compiler exited 1
Tue Aug 11 18:18:39 2026 ===  0.000097 === cpucycles/gettimeofday compiling clang -fPIC -Wall -fomit-frame-pointer -fwrapv -Qunused-arguments -mavx2 -O3
Tue Aug 11 18:18:39 2026 ===  0.034948 === output
> gcc: error: unrecognized command-line option ‘-Qunused-arguments’
Tue Aug 11 18:18:39 2026 ===  0.000402 === cpucycles/cpucycles.c compiler exited 1
Tue Aug 11 18:18:39 2026 ===  0.000149 === cpucycles/ia64cpuinfo compiling gcc -fPIC -Wall -fomit-frame-pointer -fwrapv -O3
Tue Aug 11 18:18:39 2026 ===  0.161368 === output
> cpucycles.c: In function ‘djbsort_cpucycles’:
> cpucycles.c:12:1: warning: unsupported size for integer register
>    12 | }
>       | ^
> cpucycles.c: Assembler messages:
> cpucycles.c:10: Error: junk `=ar.itc' after register
Tue Aug 11 18:18:39 2026 ===  0.000459 === cpucycles/cpucycles.c compiler exited 1
Tue Aug 11 18:18:39 2026 ===  0.000107 === cpucycles/ia64cpuinfo compiling gcc -fPIC -Wall -fomit-frame-pointer -fwrapv -march=core-avx2 -O3
Tue Aug 11 18:18:39 2026 ===  0.367297 === output
> cpucycles.c: In function ‘djbsort_cpucycles’:
> cpucycles.c:12:1: warning: unsupported size for integer register
>    12 | }
>       | ^
> cpucycles.c: Assembler messages:
> cpucycles.c:10: Error: junk `=ar.itc' after register
Tue Aug 11 18:18:39 2026 ===  0.000437 === cpucycles/cpucycles.c compiler exited 1
Tue Aug 11 18:18:39 2026 ===  0.000104 === cpucycles/ia64cpuinfo compiling clang -fPIC -Wall -fomit-frame-pointer -fwrapv -Qunused-arguments -O3
Tue Aug 11 18:18:39 2026 ===  0.034035 === output
> gcc: error: unrecognized command-line option ‘-Qunused-arguments’
Tue Aug 11 18:18:39 2026 ===  0.000404 === cpucycles/cpucycles.c compiler exited 1
Tue Aug 11 18:18:39 2026 ===  0.000107 === cpucycles/ia64cpuinfo compiling clang -fPIC -Wall -fomit-frame-pointer -fwrapv -Qunused-arguments -mavx2 -O3
Tue Aug 11 18:18:39 2026 ===  0.033067 === output
> gcc: error: unrecognized command-line option ‘-Qunused-arguments’
Tue Aug 11 18:18:39 2026 ===  0.000427 === cpucycles/cpucycles.c compiler exited 1
Tue Aug 11 18:18:39 2026 ===  0.000147 === cpucycles/mips compiling gcc -fPIC -Wall -fomit-frame-pointer -fwrapv -O3
Tue Aug 11 18:18:40 2026 ===  0.178830 === output
> cpucycles.c: In function ‘djbsort_cpucycles’:
> cpucycles.c:36:13: warning: pointer targets in passing argument 1 of ‘readticks’ differ in signedness [-Wpointer-sign]
>    36 |   readticks(now);
>       |             ^~~
>       |             |
>       |             int *
> cpucycles.c:18:37: note: expected ‘unsigned int *’ but argument is of type ‘int *’
>    18 | static void readticks(unsigned int *result)
>       |                       ~~~~~~~~~~~~~~^~~~~~
> In function ‘readticks’,
>     inlined from ‘djbsort_cpucycles’ at cpucycles.c:36:3:
> cpucycles.c:22:3: error: unknown register name ‘$2’ in ‘asm’
>    22 |   asm volatile(".long 2080510011; move %0,$2" : "=r"(cc) : : "$2");
>       |   ^~~
Tue Aug 11 18:18:40 2026 ===  0.000436 === cpucycles/cpucycles.c compiler exited 1
Tue Aug 11 18:18:40 2026 ===  0.000106 === cpucycles/mips compiling gcc -fPIC -Wall -fomit-frame-pointer -fwrapv -march=core-avx2 -O3
Tue Aug 11 18:18:40 2026 ===  0.235497 === output
> cpucycles.c: In function ‘djbsort_cpucycles’:
> cpucycles.c:36:13: warning: pointer targets in passing argument 1 of ‘readticks’ differ in signedness [-Wpointer-sign]
>    36 |   readticks(now);
>       |             ^~~
>       |             |
>       |             int *
> cpucycles.c:18:37: note: expected ‘unsigned int *’ but argument is of type ‘int *’
>    18 | static void readticks(unsigned int *result)
>       |                       ~~~~~~~~~~~~~~^~~~~~
> In function ‘readticks’,
>     inlined from ‘djbsort_cpucycles’ at cpucycles.c:36:3:
> cpucycles.c:22:3: error: unknown register name ‘$2’ in ‘asm’
>    22 |   asm volatile(".long 2080510011; move %0,$2" : "=r"(cc) : : "$2");
>       |   ^~~
Tue Aug 11 18:18:40 2026 ===  0.000429 === cpucycles/cpucycles.c compiler exited 1
Tue Aug 11 18:18:40 2026 ===  0.000097 === cpucycles/mips compiling clang -fPIC -Wall -fomit-frame-pointer -fwrapv -Qunused-arguments -O3
Tue Aug 11 18:18:40 2026 ===  0.182780 === output
> gcc: error: unrecognized command-line option ‘-Qunused-arguments’
Tue Aug 11 18:18:40 2026 ===  0.000416 === cpucycles/cpucycles.c compiler exited 1
Tue Aug 11 18:18:40 2026 ===  0.000136 === cpucycles/mips compiling clang -fPIC -Wall -fomit-frame-pointer -fwrapv -Qunused-arguments -mavx2 -O3
Tue Aug 11 18:18:40 2026 ===  0.033586 === output
> gcc: error: unrecognized command-line option ‘-Qunused-arguments’
Tue Aug 11 18:18:40 2026 ===  0.000429 === cpucycles/cpucycles.c compiler exited 1
Tue Aug 11 18:18:40 2026 ===  0.000153 === cpucycles/monotonic compiling gcc -fPIC -Wall -fomit-frame-pointer -fwrapv -O3
Tue Aug 11 18:18:40 2026 ===  0.263050 === cpucycles/monotonic compiling gcc -fPIC -Wall -fomit-frame-pointer -fwrapv -march=core-avx2 -O3
Tue Aug 11 18:18:41 2026 ===  0.239559 === cpucycles/monotonic compiling clang -fPIC -Wall -fomit-frame-pointer -fwrapv -Qunused-arguments -O3
Tue Aug 11 18:18:41 2026 ===  0.032761 === output
> gcc: error: unrecognized command-line option ‘-Qunused-arguments’
Tue Aug 11 18:18:41 2026 ===  0.000417 === cpucycles/cpucycles.c compiler exited 1
Tue Aug 11 18:18:41 2026 ===  0.000110 === cpucycles/monotonic compiling clang -fPIC -Wall -fomit-frame-pointer -fwrapv -Qunused-arguments -mavx2 -O3
Tue Aug 11 18:18:41 2026 ===  0.032690 === output
> gcc: error: unrecognized command-line option ‘-Qunused-arguments’
Tue Aug 11 18:18:41 2026 ===  0.000404 === cpucycles/cpucycles.c compiler exited 1
Tue Aug 11 18:18:41 2026 ===  0.000140 === cpucycles/monotoniccpuinfo compiling gcc -fPIC -Wall -fomit-frame-pointer -fwrapv -O3
Tue Aug 11 18:18:41 2026 ===  0.627254 === cpucycles/monotoniccpuinfo compiling gcc -fPIC -Wall -fomit-frame-pointer -fwrapv -march=core-avx2 -O3
Tue Aug 11 18:18:42 2026 ===  0.483057 === cpucycles/monotoniccpuinfo compiling clang -fPIC -Wall -fomit-frame-pointer -fwrapv -Qunused-arguments -O3
Tue Aug 11 18:18:42 2026 ===  0.034487 === output
> gcc: error: unrecognized command-line option ‘-Qunused-arguments’
Tue Aug 11 18:18:42 2026 ===  0.000429 === cpucycles/cpucycles.c compiler exited 1
Tue Aug 11 18:18:42 2026 ===  0.000117 === cpucycles/monotoniccpuinfo compiling clang -fPIC -Wall -fomit-frame-pointer -fwrapv -Qunused-arguments -mavx2 -O3
Tue Aug 11 18:18:42 2026 ===  0.032383 === output
> gcc: error: unrecognized command-line option ‘-Qunused-arguments’
Tue Aug 11 18:18:42 2026 ===  0.000440 === cpucycles/cpucycles.c compiler exited 1
Tue Aug 11 18:18:42 2026 ===  0.000151 === cpucycles/perfevent compiling gcc -fPIC -Wall -fomit-frame-pointer -fwrapv -O3
Tue Aug 11 18:18:42 2026 ===  0.033740 === output
> cpucycles.c:6:10: fatal error: linux/perf_event.h: No such file or directory
>     6 | #include <linux/perf_event.h>
>       |          ^~~~~~~~~~~~~~~~~~~~
> compilation terminated.
Tue Aug 11 18:18:42 2026 ===  0.000434 === cpucycles/cpucycles.c compiler exited 1
Tue Aug 11 18:18:42 2026 ===  0.000108 === cpucycles/perfevent compiling gcc -fPIC -Wall -fomit-frame-pointer -fwrapv -march=core-avx2 -O3
Tue Aug 11 18:18:42 2026 ===  0.034617 === output
> cpucycles.c:6:10: fatal error: linux/perf_event.h: No such file or directory
>     6 | #include <linux/perf_event.h>
>       |          ^~~~~~~~~~~~~~~~~~~~
> compilation terminated.
Tue Aug 11 18:18:42 2026 ===  0.000420 === cpucycles/cpucycles.c compiler exited 1
Tue Aug 11 18:18:42 2026 ===  0.000128 === cpucycles/perfevent compiling clang -fPIC -Wall -fomit-frame-pointer -fwrapv -Qunused-arguments -O3
Tue Aug 11 18:18:42 2026 ===  0.322555 === output
> gcc: error: unrecognized command-line option ‘-Qunused-arguments’
Tue Aug 11 18:18:42 2026 ===  0.000395 === cpucycles/cpucycles.c compiler exited 1
Tue Aug 11 18:18:42 2026 ===  0.000108 === cpucycles/perfevent compiling clang -fPIC -Wall -fomit-frame-pointer -fwrapv -Qunused-arguments -mavx2 -O3
Tue Aug 11 18:18:42 2026 ===  0.034500 === output
> gcc: error: unrecognized command-line option ‘-Qunused-arguments’
Tue Aug 11 18:18:42 2026 ===  0.000387 === cpucycles/cpucycles.c compiler exited 1
Tue Aug 11 18:18:42 2026 ===  0.000125 === cpucycles/powerpccpuinfo compiling gcc -fPIC -Wall -fomit-frame-pointer -fwrapv -O3
Tue Aug 11 18:18:42 2026 ===  0.135819 === output
> cpucycles.c: Assembler messages:
> cpucycles.c:35: Error: no such instruction: `mftbu %ecx'
> cpucycles.c:35: Error: no such instruction: `mftb %esi'
> cpucycles.c:35: Error: no such instruction: `mftbu %ebx'
> cpucycles.c:35: Error: no such instruction: `mftbu %esi'
> cpucycles.c:35: Error: no such instruction: `mftb %edi'
> cpucycles.c:35: Error: no such instruction: `mftbu %eax'
> cpucycles.c:35: Error: no such instruction: `mftbu %edx'
> cpucycles.c:35: Error: no such instruction: `mftb %ebx'
> cpucycles.c:35: Error: no such instruction: `mftbu %ecx'
Tue Aug 11 18:18:42 2026 ===  0.000417 === cpucycles/cpucycles.c compiler exited 1
Tue Aug 11 18:18:42 2026 ===  0.000100 === cpucycles/powerpccpuinfo compiling gcc -fPIC -Wall -fomit-frame-pointer -fwrapv -march=core-avx2 -O3
Tue Aug 11 18:18:42 2026 ===  0.148457 === output
> cpucycles.c: Assembler messages:
> cpucycles.c:35: Error: no such instruction: `mftbu %ecx'
> cpucycles.c:35: Error: no such instruction: `mftb %esi'
> cpucycles.c:35: Error: no such instruction: `mftbu %ebx'
> cpucycles.c:35: Error: no such instruction: `mftbu %esi'
> cpucycles.c:35: Error: no such instruction: `mftb %edi'
> cpucycles.c:35: Error: no such instruction: `mftbu %eax'
> cpucycles.c:35: Error: no such instruction: `mftbu %edx'
> cpucycles.c:35: Error: no such instruction: `mftb %ebx'
> cpucycles.c:35: Error: no such instruction: `mftbu %ecx'
Tue Aug 11 18:18:42 2026 ===  0.000402 === cpucycles/cpucycles.c compiler exited 1
Tue Aug 11 18:18:42 2026 ===  0.000107 === cpucycles/powerpccpuinfo compiling clang -fPIC -Wall -fomit-frame-pointer -fwrapv -Qunused-arguments -O3
Tue Aug 11 18:18:43 2026 ===  0.032743 === output
> gcc: error: unrecognized command-line option ‘-Qunused-arguments’
Tue Aug 11 18:18:43 2026 ===  0.000442 === cpucycles/cpucycles.c compiler exited 1
Tue Aug 11 18:18:43 2026 ===  0.000107 === cpucycles/powerpccpuinfo compiling clang -fPIC -Wall -fomit-frame-pointer -fwrapv -Qunused-arguments -mavx2 -O3
Tue Aug 11 18:18:43 2026 ===  0.034023 === output
> gcc: error: unrecognized command-line option ‘-Qunused-arguments’
Tue Aug 11 18:18:43 2026 ===  0.000424 === cpucycles/cpucycles.c compiler exited 1
Tue Aug 11 18:18:43 2026 ===  0.000148 === cpucycles/powerpcmacos compiling gcc -fPIC -Wall -fomit-frame-pointer -fwrapv -O3
Tue Aug 11 18:18:43 2026 ===  0.763215 === output
> cpucycles.c:3:10: fatal error: mach/mach_time.h: No such file or directory
>     3 | #include <mach/mach_time.h>
>       |          ^~~~~~~~~~~~~~~~~~
> compilation terminated.
Tue Aug 11 18:18:43 2026 ===  0.000367 === cpucycles/cpucycles.c compiler exited 1
Tue Aug 11 18:18:43 2026 ===  0.000089 === cpucycles/powerpcmacos compiling gcc -fPIC -Wall -fomit-frame-pointer -fwrapv -march=core-avx2 -O3
Tue Aug 11 18:18:43 2026 ===  0.043474 === output
> cpucycles.c:3:10: fatal error: mach/mach_time.h: No such file or directory
>     3 | #include <mach/mach_time.h>
>       |          ^~~~~~~~~~~~~~~~~~
> compilation terminated.
Tue Aug 11 18:18:43 2026 ===  0.000400 === cpucycles/cpucycles.c compiler exited 1
Tue Aug 11 18:18:43 2026 ===  0.000099 === cpucycles/powerpcmacos compiling clang -fPIC -Wall -fomit-frame-pointer -fwrapv -Qunused-arguments -O3
Tue Aug 11 18:18:43 2026 ===  0.035052 === output
> gcc: error: unrecognized command-line option ‘-Qunused-arguments’
Tue Aug 11 18:18:43 2026 ===  0.000384 === cpucycles/cpucycles.c compiler exited 1
Tue Aug 11 18:18:43 2026 ===  0.000087 === cpucycles/powerpcmacos compiling clang -fPIC -Wall -fomit-frame-pointer -fwrapv -Qunused-arguments -mavx2 -O3
Tue Aug 11 18:18:43 2026 ===  0.035622 === output
> gcc: error: unrecognized command-line option ‘-Qunused-arguments’
Tue Aug 11 18:18:43 2026 ===  0.000401 === cpucycles/cpucycles.c compiler exited 1
Tue Aug 11 18:18:43 2026 ===  0.000150 === cpucycles/sparc32cpuinfo compiling gcc -fPIC -Wall -fomit-frame-pointer -fwrapv -O3
Tue Aug 11 18:18:43 2026 ===  0.054426 === output
> cpucycles.c: In function ‘djbsort_cpucycles’:
> cpucycles.c:10:3: error: unknown register name ‘o4’ in ‘asm’
>    10 |   asm volatile(".word 2202075136; .word 2570088480; srl %%g1,0,%L0; mov %%o4,%H0"
>       |   ^~~
> cpucycles.c:10:3: error: unknown register name ‘g1’ in ‘asm’
Tue Aug 11 18:18:43 2026 ===  0.000402 === cpucycles/cpucycles.c compiler exited 1
Tue Aug 11 18:18:43 2026 ===  0.000104 === cpucycles/sparc32cpuinfo compiling gcc -fPIC -Wall -fomit-frame-pointer -fwrapv -march=core-avx2 -O3
Tue Aug 11 18:18:44 2026 ===  0.057301 === output
> cpucycles.c: In function ‘djbsort_cpucycles’:
> cpucycles.c:10:3: error: unknown register name ‘o4’ in ‘asm’
>    10 |   asm volatile(".word 2202075136; .word 2570088480; srl %%g1,0,%L0; mov %%o4,%H0"
>       |   ^~~
> cpucycles.c:10:3: error: unknown register name ‘g1’ in ‘asm’
Tue Aug 11 18:18:44 2026 ===  0.000418 === cpucycles/cpucycles.c compiler exited 1
Tue Aug 11 18:18:44 2026 ===  0.000096 === cpucycles/sparc32cpuinfo compiling clang -fPIC -Wall -fomit-frame-pointer -fwrapv -Qunused-arguments -O3
Tue Aug 11 18:18:44 2026 ===  0.035183 === output
> gcc: error: unrecognized command-line option ‘-Qunused-arguments’
Tue Aug 11 18:18:44 2026 ===  0.000365 === cpucycles/cpucycles.c compiler exited 1
Tue Aug 11 18:18:44 2026 ===  0.000082 === cpucycles/sparc32cpuinfo compiling clang -fPIC -Wall -fomit-frame-pointer -fwrapv -Qunused-arguments -mavx2 -O3
Tue Aug 11 18:18:44 2026 ===  0.035611 === output
> gcc: error: unrecognized command-line option ‘-Qunused-arguments’
Tue Aug 11 18:18:44 2026 ===  0.000517 === cpucycles/cpucycles.c compiler exited 1
Tue Aug 11 18:18:44 2026 ===  0.000133 === cpucycles/sparccpuinfo compiling gcc -fPIC -Wall -fomit-frame-pointer -fwrapv -O3
Tue Aug 11 18:18:44 2026 ===  0.088793 === output
> cpucycles.c: In function ‘djbsort_cpucycles’:
> cpucycles.c:12:1: warning: unsupported size for integer register
>    12 | }
>       | ^
> cpucycles.c: Assembler messages:
> cpucycles.c:10: Error: no such instruction: `rd %tick,%eax'
Tue Aug 11 18:18:44 2026 ===  0.000397 === cpucycles/cpucycles.c compiler exited 1
Tue Aug 11 18:18:44 2026 ===  0.000094 === cpucycles/sparccpuinfo compiling gcc -fPIC -Wall -fomit-frame-pointer -fwrapv -march=core-avx2 -O3
Tue Aug 11 18:18:44 2026 ===  0.186290 === output
> cpucycles.c: In function ‘djbsort_cpucycles’:
> cpucycles.c:12:1: warning: unsupported size for integer register
>    12 | }
>       | ^
> cpucycles.c: Assembler messages:
> cpucycles.c:10: Error: no such instruction: `rd %tick,%eax'
Tue Aug 11 18:18:44 2026 ===  0.000418 === cpucycles/cpucycles.c compiler exited 1
Tue Aug 11 18:18:44 2026 ===  0.000130 === cpucycles/sparccpuinfo compiling clang -fPIC -Wall -fomit-frame-pointer -fwrapv -Qunused-arguments -O3
Tue Aug 11 18:18:44 2026 ===  0.145492 === output
> gcc: error: unrecognized command-line option ‘-Qunused-arguments’
Tue Aug 11 18:18:44 2026 ===  0.000386 === cpucycles/cpucycles.c compiler exited 1
Tue Aug 11 18:18:44 2026 ===  0.000097 === cpucycles/sparccpuinfo compiling clang -fPIC -Wall -fomit-frame-pointer -fwrapv -Qunused-arguments -mavx2 -O3
Tue Aug 11 18:18:44 2026 ===  0.034624 === output
> gcc: error: unrecognized command-line option ‘-Qunused-arguments’
Tue Aug 11 18:18:44 2026 ===  0.000398 === cpucycles/cpucycles.c compiler exited 1
Tue Aug 11 18:18:44 2026 ===  0.000145 === cpucycles/vct compiling gcc -fPIC -Wall -fomit-frame-pointer -fwrapv -O3
Tue Aug 11 18:18:44 2026 ===  0.424160 === output
> cpucycles.c: In function ‘guesstbcycles’:
> cpucycles.c:52:1: warning: unsupported size for integer register
>    52 | }
>       | ^
> cpucycles.c:52:1: warning: unsupported size for integer register
> cpucycles.c: In function ‘djbsort_cpucycles’:
> cpucycles.c:82:1: warning: unsupported size for integer register
>    82 | }
>       | ^
> cpucycles.c: Assembler messages:
> cpucycles.c:30: Error: no such instruction: `mrs %eax,CNTVCT_EL0'
> cpucycles.c:30: Error: no such instruction: `mrs %esi,CNTVCT_EL0'
> cpucycles.c:30: Error: no such instruction: `mrs %eax,CNTVCT_EL0'
Tue Aug 11 18:18:44 2026 ===  0.000422 === cpucycles/cpucycles.c compiler exited 1
Tue Aug 11 18:18:44 2026 ===  0.000099 === cpucycles/vct compiling gcc -fPIC -Wall -fomit-frame-pointer -fwrapv -march=core-avx2 -O3
Tue Aug 11 18:18:45 2026 ===  0.455816 === output
> cpucycles.c: In function ‘guesstbcycles’:
> cpucycles.c:52:1: warning: unsupported size for integer register
>    52 | }
>       | ^
> cpucycles.c:52:1: warning: unsupported size for integer register
> cpucycles.c: In function ‘djbsort_cpucycles’:
> cpucycles.c:82:1: warning: unsupported size for integer register
>    82 | }
>       | ^
> cpucycles.c: Assembler messages:
> cpucycles.c:30: Error: no such instruction: `mrs %eax,CNTVCT_EL0'
> cpucycles.c:30: Error: no such instruction: `mrs %esi,CNTVCT_EL0'
> cpucycles.c:30: Error: no such instruction: `mrs %eax,CNTVCT_EL0'
Tue Aug 11 18:18:45 2026 ===  0.000395 === cpucycles/cpucycles.c compiler exited 1
Tue Aug 11 18:18:45 2026 ===  0.000101 === cpucycles/vct compiling clang -fPIC -Wall -fomit-frame-pointer -fwrapv -Qunused-arguments -O3
Tue Aug 11 18:18:45 2026 ===  0.060880 === output
> gcc: error: unrecognized command-line option ‘-Qunused-arguments’
Tue Aug 11 18:18:45 2026 ===  0.000397 === cpucycles/cpucycles.c compiler exited 1
Tue Aug 11 18:18:45 2026 ===  0.000099 === cpucycles/vct compiling clang -fPIC -Wall -fomit-frame-pointer -fwrapv -Qunused-arguments -mavx2 -O3
Tue Aug 11 18:18:45 2026 ===  0.034292 === output
> gcc: error: unrecognized command-line option ‘-Qunused-arguments’
Tue Aug 11 18:18:45 2026 ===  0.000425 === cpucycles/cpucycles.c compiler exited 1
Tue Aug 11 18:18:45 2026 ===  0.000143 === cpucycles/x86cpuinfo compiling gcc -fPIC -Wall -fomit-frame-pointer -fwrapv -O3
Tue Aug 11 18:18:46 2026 ===  0.697959 === cpucycles/x86cpuinfo compiling gcc -fPIC -Wall -fomit-frame-pointer -fwrapv -march=core-avx2 -O3
Tue Aug 11 18:18:46 2026 ===  0.308823 === cpucycles/x86cpuinfo compiling clang -fPIC -Wall -fomit-frame-pointer -fwrapv -Qunused-arguments -O3
Tue Aug 11 18:18:46 2026 ===  0.032626 === output
> gcc: error: unrecognized command-line option ‘-Qunused-arguments’
Tue Aug 11 18:18:46 2026 ===  0.000377 === cpucycles/cpucycles.c compiler exited 1
Tue Aug 11 18:18:46 2026 ===  0.000096 === cpucycles/x86cpuinfo compiling clang -fPIC -Wall -fomit-frame-pointer -fwrapv -Qunused-arguments -mavx2 -O3
Tue Aug 11 18:18:46 2026 ===  0.032927 === output
> gcc: error: unrecognized command-line option ‘-Qunused-arguments’
Tue Aug 11 18:18:46 2026 ===  0.000512 === cpucycles/cpucycles.c compiler exited 1
Tue Aug 11 18:18:46 2026 ===  0.000132 === cpucycles/x86cpuspeed compiling gcc -fPIC -Wall -fomit-frame-pointer -fwrapv -O3
Tue Aug 11 18:18:46 2026 ===  0.040437 === output
> cpucycles.c: In function ‘djbsort_cpucycles_persecond’:
> cpucycles.c:20:12: error: ‘HW_CPUSPEED’ undeclared (first use in this function)
>    20 |   oid[1] = HW_CPUSPEED;
>       |            ^~~~~~~~~~~
> cpucycles.c:20:12: note: each undeclared identifier is reported only once for each function it appears in
Tue Aug 11 18:18:46 2026 ===  0.000372 === cpucycles/cpucycles.c compiler exited 1
Tue Aug 11 18:18:46 2026 ===  0.000091 === cpucycles/x86cpuspeed compiling gcc -fPIC -Wall -fomit-frame-pointer -fwrapv -march=core-avx2 -O3
Tue Aug 11 18:18:46 2026 ===  0.120142 === output
> cpucycles.c: In function ‘djbsort_cpucycles_persecond’:
> cpucycles.c:20:12: error: ‘HW_CPUSPEED’ undeclared (first use in this function)
>    20 |   oid[1] = HW_CPUSPEED;
>       |            ^~~~~~~~~~~
> cpucycles.c:20:12: note: each undeclared identifier is reported only once for each function it appears in
Tue Aug 11 18:18:46 2026 ===  0.000395 === cpucycles/cpucycles.c compiler exited 1
Tue Aug 11 18:18:46 2026 ===  0.000102 === cpucycles/x86cpuspeed compiling clang -fPIC -Wall -fomit-frame-pointer -fwrapv -Qunused-arguments -O3
Tue Aug 11 18:18:46 2026 ===  0.194076 === output
> gcc: error: unrecognized command-line option ‘-Qunused-arguments’
Tue Aug 11 18:18:46 2026 ===  0.000395 === cpucycles/cpucycles.c compiler exited 1
Tue Aug 11 18:18:46 2026 ===  0.000095 === cpucycles/x86cpuspeed compiling clang -fPIC -Wall -fomit-frame-pointer -fwrapv -Qunused-arguments -mavx2 -O3
Tue Aug 11 18:18:47 2026 ===  0.032683 === output
> gcc: error: unrecognized command-line option ‘-Qunused-arguments’
Tue Aug 11 18:18:47 2026 ===  0.000393 === cpucycles/cpucycles.c compiler exited 1
Tue Aug 11 18:18:47 2026 ===  0.000146 === cpucycles/x86estimate compiling gcc -fPIC -Wall -fomit-frame-pointer -fwrapv -O3
Tue Aug 11 18:18:47 2026 ===  0.250449 === cpucycles/x86estimate compiling gcc -fPIC -Wall -fomit-frame-pointer -fwrapv -march=core-avx2 -O3
Tue Aug 11 18:18:47 2026 ===  0.296545 === cpucycles/x86estimate compiling clang -fPIC -Wall -fomit-frame-pointer -fwrapv -Qunused-arguments -O3
Tue Aug 11 18:18:47 2026 ===  0.032692 === output
> gcc: error: unrecognized command-line option ‘-Qunused-arguments’
Tue Aug 11 18:18:47 2026 ===  0.000379 === cpucycles/cpucycles.c compiler exited 1
Tue Aug 11 18:18:47 2026 ===  0.000088 === cpucycles/x86estimate compiling clang -fPIC -Wall -fomit-frame-pointer -fwrapv -Qunused-arguments -mavx2 -O3
Tue Aug 11 18:18:47 2026 ===  0.036444 === output
> gcc: error: unrecognized command-line option ‘-Qunused-arguments’
Tue Aug 11 18:18:47 2026 ===  0.000366 === cpucycles/cpucycles.c compiler exited 1
Tue Aug 11 18:18:47 2026 ===  0.000132 === cpucycles/x86tscfreq compiling gcc -fPIC -Wall -fomit-frame-pointer -fwrapv -O3
Tue Aug 11 18:18:47 2026 ===  0.205351 === cpucycles/x86tscfreq compiling gcc -fPIC -Wall -fomit-frame-pointer -fwrapv -march=core-avx2 -O3
Tue Aug 11 18:18:48 2026 ===  0.322809 === cpucycles/x86tscfreq compiling clang -fPIC -Wall -fomit-frame-pointer -fwrapv -Qunused-arguments -O3
Tue Aug 11 18:18:48 2026 ===  0.164061 === output
> gcc: error: unrecognized command-line option ‘-Qunused-arguments’
Tue Aug 11 18:18:48 2026 ===  0.000387 === cpucycles/cpucycles.c compiler exited 1
Tue Aug 11 18:18:48 2026 ===  0.000095 === cpucycles/x86tscfreq compiling clang -fPIC -Wall -fomit-frame-pointer -fwrapv -Qunused-arguments -mavx2 -O3
Tue Aug 11 18:18:48 2026 ===  0.105775 === output
> gcc: error: unrecognized command-line option ‘-Qunused-arguments’
Tue Aug 11 18:18:48 2026 ===  0.000380 === cpucycles/cpucycles.c compiler exited 1
Tue Aug 11 18:18:48 2026 ===  0.001814 === int32/avx2 compiling gcc -fPIC -Wall -fomit-frame-pointer -fwrapv -O3
Tue Aug 11 18:18:48 2026 ===  0.000524 === int32/avx2/sort.c compiling
Tue Aug 11 18:18:50 2026 ===  1.595373 === output
> sort.c: In function ‘djbsort_int32’:
> sort.c:939:38: warning: AVX vector return without AVX enabled changes the ABI [-Wpsabi]
>   939 |     for (i = q>>3;i < q>>2;++i) y[i] = _mm256_set1_epi32(0x7fffffff);
>       |                                 ~~~~~^~~~~~~~~~~~~~~~~~~~~~~~~~~~~~~
> In file included from /usr/include/gcc-12/immintrin.h:43,
>                  from sort.c:4:
> /usr/include/gcc-12/avxintrin.h: In function ‘minmax_vector’:
> /usr/include/gcc-12/avxintrin.h:933:1: error: inlining failed in call to ‘always_inline’ ‘_mm256_storeu_si256’: target specific option mismatch
>   933 | _mm256_storeu_si256 (__m256i_u *__P, __m256i __A)
>       | ^~~~~~~~~~~~~~~~~~~
> sort.c:9:28: note: called from here
>     9 | #define int32x8_store(z,i) _mm256_storeu_si256((__m256i *) (z),(i))
>       |                            ^~~~~~~~~~~~~~~~~~~~~~~~~~~~~~~~~~~~~~~~
> sort.c:37:5: note: in expansion of macro ‘int32x8_store’
>    37 |     int32x8_store(y + n - 8,y0);
>       |     ^~~~~~~~~~~~~
> /usr/include/gcc-12/avxintrin.h:933:1: error: inlining failed in call to ‘always_inline’ ‘_mm256_storeu_si256’: target specific option mismatch
>   933 | _mm256_storeu_si256 (__m256i_u *__P, __m256i __A)
>       | ^~~~~~~~~~~~~~~~~~~
> sort.c:9:28: note: called from here
>     9 | #define int32x8_store(z,i) _mm256_storeu_si256((__m256i *) (z),(i))
>       |                            ^~~~~~~~~~~~~~~~~~~~~~~~~~~~~~~~~~~~~~~~
> sort.c:36:5: note: in expansion of macro ‘int32x8_store’
>    36 |     int32x8_store(x + n - 8,x0);
>       |     ^~~~~~~~~~~~~
> In file included from /usr/include/gcc-12/immintrin.h:47:
> /usr/include/gcc-12/avx2intrin.h:363:1: error: inlining failed in call to ‘always_inline’ ‘_mm256_max_epi32’: target specific option mismatch
>   363 | _mm256_max_epi32 (__m256i __A, __m256i __B)
>       | ^~~~~~~~~~~~~~~~
> sort.c:11:21: note: called from here
>    11 | #define int32x8_max _mm256_max_epi32
>       |                     ^
> sort.c:16:7: note: in expansion of macro ‘int32x8_max’
>    16 |   b = int32x8_max(a,b); \
>       |       ^~~~~~~~~~~
> sort.c:35:5: note: in expansion of macro ‘int32x8_MINMAX’
>    35 |     int32x8_MINMAX(x0,y0);
>       |     ^~~~~~~~~~~~~~
> /usr/include/gcc-12/avx2intrin.h:405:1: error: inlining failed in call to ‘always_inline’ ‘_mm256_min_epi32’: target specific option mismatch
>   405 | _mm256_min_epi32 (__m256i __A, __m256i __B)
>       | ^~~~~~~~~~~~~~~~
> sort.c:10:21: note: called from here
>    10 | #define int32x8_min _mm256_min_epi32
>       |                     ^
> sort.c:15:15: note: in expansion of macro ‘int32x8_min’
>    15 |   int32x8 c = int32x8_min(a,b); \
>       |               ^~~~~~~~~~~
> sort.c:35:5: note: in expansion of macro ‘int32x8_MINMAX’
>    35 |     int32x8_MINMAX(x0,y0);
>       |     ^~~~~~~~~~~~~~
> /usr/include/gcc-12/avxintrin.h:927:1: error: inlining failed in call to ‘always_inline’ ‘_mm256_loadu_si256’: target specific option mismatch
>   927 | _mm256_loadu_si256 (__m256i_u const *__P)
>       | ^~~~~~~~~~~~~~~~~~
> sort.c:8:25: note: called from here
>     8 | #define int32x8_load(z) _mm256_loadu_si256((__m256i *) (z))
>       |                         ^~~~~~~~~~~~~~~~~~~~~~~~~~~~~~~~~~~
> sort.c:34:18: note: in expansion of macro ‘int32x8_load’
>    34 |     int32x8 y0 = int32x8_load(y + n - 8);
>       |                  ^~~~~~~~~~~~
> /usr/include/gcc-12/avxintrin.h:927:1: error: inlining failed in call to ‘always_inline’ ‘_mm256_loadu_si256’: target specific option mismatch
>   927 | _mm256_loadu_si256 (__m256i_u const *__P)
>       | ^~~~~~~~~~~~~~~~~~
> sort.c:8:25: note: called from here
>     8 | #define int32x8_load(z) _mm256_loadu_si256((__m256i *) (z))
>       |                         ^~~~~~~~~~~~~~~~~~~~~~~~~~~~~~~~~~~
> sort.c:33:18: note: in expansion of macro ‘int32x8_load’
>    33 |     int32x8 x0 = int32x8_load(x + n - 8);
>       |                  ^~~~~~~~~~~~
> /usr/include/gcc-12/avxintrin.h:933:1: error: inlining failed in call to ‘always_inline’ ‘_mm256_storeu_si256’: target specific option mismatch
>   933 | _mm256_storeu_si256 (__m256i_u *__P, __m256i __A)
>       | ^~~~~~~~~~~~~~~~~~~
> sort.c:9:28: note: called from here
>     9 | #define int32x8_store(z,i) _mm256_storeu_si256((__m256i *) (z),(i))
>       |                            ^~~~~~~~~~~~~~~~~~~~~~~~~~~~~~~~~~~~~~~~
> sort.c:45:5: note: in expansion of macro ‘int32x8_store’
>    45 |     int32x8_store(y,y0);
>       |     ^~~~~~~~~~~~~
> /usr/include/gcc-12/avxintrin.h:933:1: error: inlining failed in call to ‘always_inline’ ‘_mm256_storeu_si256’: target specific option mismatch
>   933 | _mm256_storeu_si256 (__m256i_u *__P, __m256i __A)
>       | ^~~~~~~~~~~~~~~~~~~
> sort.c:9:28: note: called from here
>     9 | #define int32x8_store(z,i) _mm256_storeu_si256((__m256i *) (z),(i))
>       |                            ^~~~~~~~~~~~~~~~~~~~~~~~~~~~~~~~~~~~~~~~
> sort.c:44:5: note: in expansion of macro ‘int32x8_store’
>    44 |     int32x8_store(x,x0);
>       |     ^~~~~~~~~~~~~
> /usr/include/gcc-12/avx2intrin.h:363:1: error: inlining failed in call to ‘always_inline’ ‘_mm256_max_epi32’: target specific option mismatch
>   363 | _mm256_max_epi32 (__m256i __A, __m256i __B)
>       | ^~~~~~~~~~~~~~~~
> sort.c:11:21: note: called from here
>    11 | #define int32x8_max _mm256_max_epi32
>       |                     ^
> sort.c:16:7: note: in expansion of macro ‘int32x8_max’
>    16 |   b = int32x8_max(a,b); \
>       |       ^~~~~~~~~~~
> sort.c:43:5: note: in expansion of macro ‘int32x8_MINMAX’
>    43 |     int32x8_MINMAX(x0,y0);
>       |     ^~~~~~~~~~~~~~
> /usr/include/gcc-12/avx2intrin.h:405:1: error: inlining failed in call to ‘always_inline’ ‘_mm256_min_epi32’: target specific option mismatch
>   405 | _mm256_min_epi32 (__m256i __A, __m256i __B)
>       | ^~~~~~~~~~~~~~~~
> sort.c:10:21: note: called from here
>    10 | #define int32x8_min _mm256_min_epi32
>       |                     ^
> sort.c:15:15: note: in expansion of macro ‘int32x8_min’
>    15 |   int32x8 c = int32x8_min(a,b); \
>       |               ^~~~~~~~~~~
> sort.c:43:5: note: in expansion of macro ‘int32x8_MINMAX’
>    43 |     int32x8_MINMAX(x0,y0);
>       |     ^~~~~~~~~~~~~~
> /usr/include/gcc-12/avxintrin.h:927:1: error: inlining failed in call to ‘always_inline’ ‘_mm256_loadu_si256’: target specific option mismatch
>   927 | _mm256_loadu_si256 (__m256i_u const *__P)
>       | ^~~~~~~~~~~~~~~~~~
> sort.c:8:25: note: called from here
>     8 | #define int32x8_load(z) _mm256_loadu_si256((__m256i *) (z))
>       |                         ^~~~~~~~~~~~~~~~~~~~~~~~~~~~~~~~~~~
> sort.c:42:18: note: in expansion of macro ‘int32x8_load’
>    42 |     int32x8 y0 = int32x8_load(y);
>       |                  ^~~~~~~~~~~~
> /usr/include/gcc-12/avxintrin.h:927:1: error: inlining failed in call to ‘always_inline’ ‘_mm256_loadu_si256’: target specific option mismatch
>   927 | _mm256_loadu_si256 (__m256i_u const *__P)
>       | ^~~~~~~~~~~~~~~~~~
> sort.c:8:25: note: called from here
>     8 | #define int32x8_load(z) _mm256_loadu_si256((__m256i *) (z))
>       |                         ^~~~~~~~~~~~~~~~~~~~~~~~~~~~~~~~~~~
> sort.c:41:18: note: in expansion of macro ‘int32x8_load’
>    41 |     int32x8 x0 = int32x8_load(x);
>       |                  ^~~~~~~~~~~~
Tue Aug 11 18:18:50 2026 ===  0.000506 === int32/avx2/sort.c compiler exited 1
Tue Aug 11 18:18:50 2026 ===  0.000113 === int32/avx2/compiler.c compiling
Tue Aug 11 18:18:50 2026 ===  0.023590 === int32/avx2/version.c compiling
Tue Aug 11 18:18:50 2026 ===  0.027089 === int32/avx2/implementation.c compiling
Tue Aug 11 18:18:50 2026 ===  0.024769 === int32/avx2/cycles.c compiling
Tue Aug 11 18:18:50 2026 ===  0.244848 === int32/avx2/works.c compiling
Tue Aug 11 18:18:50 2026 ===  0.170092 === int32/avx2 compiling gcc -fPIC -Wall -fomit-frame-pointer -fwrapv -march=core-avx2 -O3
Tue Aug 11 18:18:50 2026 ===  0.000348 === int32/avx2/sort.c compiling
Tue Aug 11 18:18:53 2026 ===  2.994698 === int32/avx2/compiler.c compiling
Tue Aug 11 18:18:53 2026 ===  0.230642 === int32/avx2/version.c compiling
Tue Aug 11 18:18:54 2026 ===  0.577635 === int32/avx2/implementation.c compiling
Tue Aug 11 18:18:54 2026 ===  0.183523 === int32/avx2/cycles.c compiling
Tue Aug 11 18:18:54 2026 ===  0.460154 === int32/avx2/works.c compiling
Tue Aug 11 18:18:55 2026 ===  0.301319 === int32/avx2 compiled gcc -fPIC -Wall -fomit-frame-pointer -fwrapv -march=core-avx2 -O3
Tue Aug 11 18:18:55 2026 ===  0.017379 === int32/avx2 compiling clang -fPIC -Wall -fomit-frame-pointer -fwrapv -Qunused-arguments -O3
Tue Aug 11 18:18:55 2026 ===  0.000246 === int32/avx2/sort.c compiling
Tue Aug 11 18:18:55 2026 ===  0.032977 === output
> gcc: error: unrecognized command-line option ‘-Qunused-arguments’
Tue Aug 11 18:18:55 2026 ===  0.000385 === int32/avx2/sort.c compiler exited 1
Tue Aug 11 18:18:55 2026 ===  0.000103 === int32/avx2/compiler.c compiling
Tue Aug 11 18:18:55 2026 ===  0.027071 === output
> gcc: error: unrecognized command-line option ‘-Qunused-arguments’
Tue Aug 11 18:18:55 2026 ===  0.000381 === int32/avx2/compiler.c compiler exited 1
Tue Aug 11 18:18:55 2026 ===  0.000092 === int32/avx2/version.c compiling
Tue Aug 11 18:18:55 2026 ===  0.027157 === output
> gcc: error: unrecognized command-line option ‘-Qunused-arguments’
Tue Aug 11 18:18:55 2026 ===  0.000336 === int32/avx2/version.c compiler exited 1
Tue Aug 11 18:18:55 2026 ===  0.000090 === int32/avx2/implementation.c compiling
Tue Aug 11 18:18:55 2026 ===  0.027788 === output
> gcc: error: unrecognized command-line option ‘-Qunused-arguments’
Tue Aug 11 18:18:55 2026 ===  0.000363 === int32/avx2/implementation.c compiler exited 1
Tue Aug 11 18:18:55 2026 ===  0.000106 === int32/avx2/cycles.c compiling
Tue Aug 11 18:18:55 2026 ===  0.101956 === output
> gcc: error: unrecognized command-line option ‘-Qunused-arguments’
Tue Aug 11 18:18:55 2026 ===  0.000393 === int32/avx2/cycles.c compiler exited 1
Tue Aug 11 18:18:55 2026 ===  0.000097 === int32/avx2/works.c compiling
Tue Aug 11 18:18:55 2026 ===  0.372594 === output
> gcc: error: unrecognized command-line option ‘-Qunused-arguments’
Tue Aug 11 18:18:55 2026 ===  0.000384 === int32/avx2/works.c compiler exited 1
Tue Aug 11 18:18:55 2026 ===  0.000099 === int32/avx2 compiling clang -fPIC -Wall -fomit-frame-pointer -fwrapv -Qunused-arguments -mavx2 -O3
Tue Aug 11 18:18:55 2026 ===  0.000197 === int32/avx2/sort.c compiling
Tue Aug 11 18:18:55 2026 ===  0.031542 === output
> gcc: error: unrecognized command-line option ‘-Qunused-arguments’
Tue Aug 11 18:18:55 2026 ===  0.000433 === int32/avx2/sort.c compiler exited 1
Tue Aug 11 18:18:55 2026 ===  0.000102 === int32/avx2/compiler.c compiling
Tue Aug 11 18:18:56 2026 ===  0.140226 === output
> gcc: error: unrecognized command-line option ‘-Qunused-arguments’
Tue Aug 11 18:18:56 2026 ===  0.000357 === int32/avx2/compiler.c compiler exited 1
Tue Aug 11 18:18:56 2026 ===  0.000096 === int32/avx2/version.c compiling
Tue Aug 11 18:18:56 2026 ===  0.031272 === output
> gcc: error: unrecognized command-line option ‘-Qunused-arguments’
Tue Aug 11 18:18:56 2026 ===  0.000379 === int32/avx2/version.c compiler exited 1
Tue Aug 11 18:18:56 2026 ===  0.000111 === int32/avx2/implementation.c compiling
Tue Aug 11 18:18:56 2026 ===  0.031592 === output
> gcc: error: unrecognized command-line option ‘-Qunused-arguments’
Tue Aug 11 18:18:56 2026 ===  0.000399 === int32/avx2/implementation.c compiler exited 1
Tue Aug 11 18:18:56 2026 ===  0.000116 === int32/avx2/cycles.c compiling
Tue Aug 11 18:18:56 2026 ===  0.031638 === output
> gcc: error: unrecognized command-line option ‘-Qunused-arguments’
Tue Aug 11 18:18:56 2026 ===  0.000423 === int32/avx2/cycles.c compiler exited 1
Tue Aug 11 18:18:56 2026 ===  0.000119 === int32/avx2/works.c compiling
Tue Aug 11 18:18:56 2026 ===  0.032255 === output
> gcc: error: unrecognized command-line option ‘-Qunused-arguments’
Tue Aug 11 18:18:56 2026 ===  0.000411 === int32/avx2/works.c compiler exited 1
Tue Aug 11 18:18:56 2026 ===  0.001739 === int32/portable3 compiling gcc -fPIC -Wall -fomit-frame-pointer -fwrapv -O3
Tue Aug 11 18:18:56 2026 ===  0.000153 === int32/portable3/sort.c compiling
Tue Aug 11 18:18:56 2026 ===  0.263383 === int32/portable3/compiler.c compiling
Tue Aug 11 18:18:56 2026 ===  0.029597 === int32/portable3/version.c compiling
Tue Aug 11 18:18:56 2026 ===  0.027538 === int32/portable3/implementation.c compiling
Tue Aug 11 18:18:56 2026 ===  0.027312 === int32/portable3/cycles.c compiling
Tue Aug 11 18:18:56 2026 ===  0.108506 === int32/portable3/works.c compiling
Tue Aug 11 18:18:56 2026 ===  0.245167 === int32/portable3 compiled gcc -fPIC -Wall -fomit-frame-pointer -fwrapv -O3
Tue Aug 11 18:18:56 2026 ===  0.018631 === int32/portable3 compiling gcc -fPIC -Wall -fomit-frame-pointer -fwrapv -march=core-avx2 -O3
Tue Aug 11 18:18:56 2026 ===  0.000279 === int32/portable3/sort.c compiling
Tue Aug 11 18:18:57 2026 ===  0.139129 === int32/portable3/compiler.c compiling
Tue Aug 11 18:18:57 2026 ===  0.029626 === int32/portable3/version.c compiling
Tue Aug 11 18:18:57 2026 ===  0.028397 === int32/portable3/implementation.c compiling
Tue Aug 11 18:18:57 2026 ===  0.028459 === int32/portable3/cycles.c compiling
Tue Aug 11 18:18:57 2026 ===  0.195152 === int32/portable3/works.c compiling
Tue Aug 11 18:18:57 2026 ===  0.367623 === int32/portable3 compiled gcc -fPIC -Wall -fomit-frame-pointer -fwrapv -march=core-avx2 -O3
Tue Aug 11 18:18:57 2026 ===  0.016358 === int32/portable3 compiling clang -fPIC -Wall -fomit-frame-pointer -fwrapv -Qunused-arguments -O3
Tue Aug 11 18:18:57 2026 ===  0.000231 === int32/portable3/sort.c compiling
Tue Aug 11 18:18:57 2026 ===  0.034225 === output
> gcc: error: unrecognized command-line option ‘-Qunused-arguments’
Tue Aug 11 18:18:57 2026 ===  0.000384 === int32/portable3/sort.c compiler exited 1
Tue Aug 11 18:18:57 2026 ===  0.000142 === int32/portable3/compiler.c compiling
Tue Aug 11 18:18:57 2026 ===  0.032376 === output
> gcc: error: unrecognized command-line option ‘-Qunused-arguments’
Tue Aug 11 18:18:57 2026 ===  0.000385 === int32/portable3/compiler.c compiler exited 1
Tue Aug 11 18:18:57 2026 ===  0.000114 === int32/portable3/version.c compiling
Tue Aug 11 18:18:57 2026 ===  0.048958 === output
> gcc: error: unrecognized command-line option ‘-Qunused-arguments’
Tue Aug 11 18:18:57 2026 ===  0.000396 === int32/portable3/version.c compiler exited 1
Tue Aug 11 18:18:57 2026 ===  0.000122 === int32/portable3/implementation.c compiling
Tue Aug 11 18:18:57 2026 ===  0.172528 === output
> gcc: error: unrecognized command-line option ‘-Qunused-arguments’
Tue Aug 11 18:18:57 2026 ===  0.000430 === int32/portable3/implementation.c compiler exited 1
Tue Aug 11 18:18:57 2026 ===  0.000121 === int32/portable3/cycles.c compiling
Tue Aug 11 18:18:58 2026 ===  0.278537 === output
> gcc: error: unrecognized command-line option ‘-Qunused-arguments’
Tue Aug 11 18:18:58 2026 ===  0.000422 === int32/portable3/cycles.c compiler exited 1
Tue Aug 11 18:18:58 2026 ===  0.000118 === int32/portable3/works.c compiling
Tue Aug 11 18:18:58 2026 ===  0.152915 === output
> gcc: error: unrecognized command-line option ‘-Qunused-arguments’
Tue Aug 11 18:18:58 2026 ===  0.000401 === int32/portable3/works.c compiler exited 1
Tue Aug 11 18:18:58 2026 ===  0.000119 === int32/portable3 compiling clang -fPIC -Wall -fomit-frame-pointer -fwrapv -Qunused-arguments -mavx2 -O3
Tue Aug 11 18:18:58 2026 ===  0.000239 === int32/portable3/sort.c compiling
Tue Aug 11 18:18:58 2026 ===  0.094680 === output
> gcc: error: unrecognized command-line option ‘-Qunused-arguments’
Tue Aug 11 18:18:58 2026 ===  0.000328 === int32/portable3/sort.c compiler exited 1
Tue Aug 11 18:18:58 2026 ===  0.000109 === int32/portable3/compiler.c compiling
Tue Aug 11 18:18:58 2026 ===  0.033903 === output
> gcc: error: unrecognized command-line option ‘-Qunused-arguments’
Tue Aug 11 18:18:58 2026 ===  0.000351 === int32/portable3/compiler.c compiler exited 1
Tue Aug 11 18:18:58 2026 ===  0.000096 === int32/portable3/version.c compiling
Tue Aug 11 18:18:58 2026 ===  0.034185 === output
> gcc: error: unrecognized command-line option ‘-Qunused-arguments’
Tue Aug 11 18:18:58 2026 ===  0.000352 === int32/portable3/version.c compiler exited 1
Tue Aug 11 18:18:58 2026 ===  0.000092 === int32/portable3/implementation.c compiling
Tue Aug 11 18:18:58 2026 ===  0.035603 === output
> gcc: error: unrecognized command-line option ‘-Qunused-arguments’
Tue Aug 11 18:18:58 2026 ===  0.000365 === int32/portable3/implementation.c compiler exited 1
Tue Aug 11 18:18:58 2026 ===  0.000106 === int32/portable3/cycles.c compiling
Tue Aug 11 18:18:58 2026 ===  0.167121 === output
> gcc: error: unrecognized command-line option ‘-Qunused-arguments’
Tue Aug 11 18:18:58 2026 ===  0.000415 === int32/portable3/cycles.c compiler exited 1
Tue Aug 11 18:18:58 2026 ===  0.000111 === int32/portable3/works.c compiling
Tue Aug 11 18:18:58 2026 ===  0.033467 === output
> gcc: error: unrecognized command-line option ‘-Qunused-arguments’
Tue Aug 11 18:18:58 2026 ===  0.000399 === int32/portable3/works.c compiler exited 1
Tue Aug 11 18:18:58 2026 ===  0.001637 === int32/portable4 compiling gcc -fPIC -Wall -fomit-frame-pointer -fwrapv -O3
Tue Aug 11 18:18:58 2026 ===  0.000151 === int32/portable4/sort.c compiling
Tue Aug 11 18:18:58 2026 ===  0.133862 === int32/portable4/compiler.c compiling
Tue Aug 11 18:18:58 2026 ===  0.026993 === int32/portable4/version.c compiling
Tue Aug 11 18:18:59 2026 ===  0.026954 === int32/portable4/implementation.c compiling
Tue Aug 11 18:18:59 2026 ===  0.027065 === int32/portable4/cycles.c compiling
Tue Aug 11 18:18:59 2026 ===  0.116543 === int32/portable4/works.c compiling
Tue Aug 11 18:18:59 2026 ===  0.577485 === int32/portable4 compiled gcc -fPIC -Wall -fomit-frame-pointer -fwrapv -O3
Tue Aug 11 18:18:59 2026 ===  0.018021 === int32/portable4 compiling gcc -fPIC -Wall -fomit-frame-pointer -fwrapv -march=core-avx2 -O3
Tue Aug 11 18:18:59 2026 ===  0.000234 === int32/portable4/sort.c compiling
Tue Aug 11 18:19:00 2026 ===  0.510076 === int32/portable4/compiler.c compiling
Tue Aug 11 18:19:00 2026 ===  0.028107 === int32/portable4/version.c compiling
Tue Aug 11 18:19:00 2026 ===  0.027052 === int32/portable4/implementation.c compiling
Tue Aug 11 18:19:00 2026 ===  0.029145 === int32/portable4/cycles.c compiling
Tue Aug 11 18:19:00 2026 ===  0.602586 === int32/portable4/works.c compiling
Tue Aug 11 18:19:01 2026 ===  0.756850 === int32/portable4 compiled gcc -fPIC -Wall -fomit-frame-pointer -fwrapv -march=core-avx2 -O3
Tue Aug 11 18:19:01 2026 ===  0.017168 === int32/portable4 compiling clang -fPIC -Wall -fomit-frame-pointer -fwrapv -Qunused-arguments -O3
Tue Aug 11 18:19:01 2026 ===  0.000236 === int32/portable4/sort.c compiling
Tue Aug 11 18:19:01 2026 ===  0.033164 === output
> gcc: error: unrecognized command-line option ‘-Qunused-arguments’
Tue Aug 11 18:19:01 2026 ===  0.000325 === int32/portable4/sort.c compiler exited 1
Tue Aug 11 18:19:01 2026 ===  0.000095 === int32/portable4/compiler.c compiling
Tue Aug 11 18:19:01 2026 ===  0.034034 === output
> gcc: error: unrecognized command-line option ‘-Qunused-arguments’
Tue Aug 11 18:19:01 2026 ===  0.000348 === int32/portable4/compiler.c compiler exited 1
Tue Aug 11 18:19:01 2026 ===  0.000093 === int32/portable4/version.c compiling
Tue Aug 11 18:19:01 2026 ===  0.031103 === output
> gcc: error: unrecognized command-line option ‘-Qunused-arguments’
Tue Aug 11 18:19:01 2026 ===  0.000361 === int32/portable4/version.c compiler exited 1
Tue Aug 11 18:19:01 2026 ===  0.000098 === int32/portable4/implementation.c compiling
Tue Aug 11 18:19:01 2026 ===  0.032413 === output
> gcc: error: unrecognized command-line option ‘-Qunused-arguments’
Tue Aug 11 18:19:01 2026 ===  0.000344 === int32/portable4/implementation.c compiler exited 1
Tue Aug 11 18:19:01 2026 ===  0.000092 === int32/portable4/cycles.c compiling
Tue Aug 11 18:19:01 2026 ===  0.031573 === output
> gcc: error: unrecognized command-line option ‘-Qunused-arguments’
Tue Aug 11 18:19:01 2026 ===  0.000346 === int32/portable4/cycles.c compiler exited 1
Tue Aug 11 18:19:01 2026 ===  0.000096 === int32/portable4/works.c compiling
Tue Aug 11 18:19:01 2026 ===  0.033423 === output
> gcc: error: unrecognized command-line option ‘-Qunused-arguments’
Tue Aug 11 18:19:01 2026 ===  0.000388 === int32/portable4/works.c compiler exited 1
Tue Aug 11 18:19:01 2026 ===  0.000109 === int32/portable4 compiling clang -fPIC -Wall -fomit-frame-pointer -fwrapv -Qunused-arguments -mavx2 -O3
Tue Aug 11 18:19:01 2026 ===  0.000237 === int32/portable4/sort.c compiling
Tue Aug 11 18:19:01 2026 ===  0.029237 === output
> gcc: error: unrecognized command-line option ‘-Qunused-arguments’
Tue Aug 11 18:19:01 2026 ===  0.000373 === int32/portable4/sort.c compiler exited 1
Tue Aug 11 18:19:01 2026 ===  0.000112 === int32/portable4/compiler.c compiling
Tue Aug 11 18:19:01 2026 ===  0.046480 === output
> gcc: error: unrecognized command-line option ‘-Qunused-arguments’
Tue Aug 11 18:19:01 2026 ===  0.000389 === int32/portable4/compiler.c compiler exited 1
Tue Aug 11 18:19:01 2026 ===  0.000113 === int32/portable4/version.c compiling
Tue Aug 11 18:19:02 2026 ===  0.033622 === output
> gcc: error: unrecognized command-line option ‘-Qunused-arguments’
Tue Aug 11 18:19:02 2026 ===  0.000535 === int32/portable4/version.c compiler exited 1
Tue Aug 11 18:19:02 2026 ===  0.000115 === int32/portable4/implementation.c compiling
Tue Aug 11 18:19:02 2026 ===  0.033733 === output
> gcc: error: unrecognized command-line option ‘-Qunused-arguments’
Tue Aug 11 18:19:02 2026 ===  0.000414 === int32/portable4/implementation.c compiler exited 1
Tue Aug 11 18:19:02 2026 ===  0.000129 === int32/portable4/cycles.c compiling
Tue Aug 11 18:19:02 2026 ===  0.033307 === output
> gcc: error: unrecognized command-line option ‘-Qunused-arguments’
Tue Aug 11 18:19:02 2026 ===  0.000382 === int32/portable4/cycles.c compiler exited 1
Tue Aug 11 18:19:02 2026 ===  0.000112 === int32/portable4/works.c compiling
Tue Aug 11 18:19:02 2026 ===  0.037560 === output
> gcc: error: unrecognized command-line option ‘-Qunused-arguments’
Tue Aug 11 18:19:02 2026 ===  0.000430 === int32/portable4/works.c compiler exited 1
Tue Aug 11 18:19:02 2026 ===  0.001853 === uint32/useint32 compiling gcc -fPIC -Wall -fomit-frame-pointer -fwrapv -O3
Tue Aug 11 18:19:02 2026 ===  0.000148 === uint32/useint32/sort.c compiling
Tue Aug 11 18:19:02 2026 ===  0.047607 === uint32/useint32/compiler.c compiling
Tue Aug 11 18:19:02 2026 ===  0.026619 === uint32/useint32/version.c compiling
Tue Aug 11 18:19:02 2026 ===  0.027214 === uint32/useint32/implementation.c compiling
Tue Aug 11 18:19:02 2026 ===  0.026911 === uint32/useint32/cycles.c compiling
Tue Aug 11 18:19:02 2026 ===  0.132220 === uint32/useint32/works.c compiling
Tue Aug 11 18:19:02 2026 ===  0.109260 === uint32/useint32 compiled gcc -fPIC -Wall -fomit-frame-pointer -fwrapv -O3
Tue Aug 11 18:19:02 2026 ===  0.017533 === uint32/useint32 compiling gcc -fPIC -Wall -fomit-frame-pointer -fwrapv -march=core-avx2 -O3
Tue Aug 11 18:19:02 2026 ===  0.000253 === uint32/useint32/sort.c compiling
Tue Aug 11 18:19:02 2026 ===  0.076085 === uint32/useint32/compiler.c compiling
Tue Aug 11 18:19:02 2026 ===  0.028295 === uint32/useint32/version.c compiling
Tue Aug 11 18:19:02 2026 ===  0.028232 === uint32/useint32/implementation.c compiling
Tue Aug 11 18:19:02 2026 ===  0.026824 === uint32/useint32/cycles.c compiling
Tue Aug 11 18:19:02 2026 ===  0.178072 === uint32/useint32/works.c compiling
Tue Aug 11 18:19:02 2026 ===  0.133206 === uint32/useint32 compiled gcc -fPIC -Wall -fomit-frame-pointer -fwrapv -march=core-avx2 -O3
Tue Aug 11 18:19:03 2026 ===  0.179536 === uint32/useint32 compiling clang -fPIC -Wall -fomit-frame-pointer -fwrapv -Qunused-arguments -O3
Tue Aug 11 18:19:03 2026 ===  0.000294 === uint32/useint32/sort.c compiling
Tue Aug 11 18:19:03 2026 ===  0.052087 === output
> gcc: error: unrecognized command-line option ‘-Qunused-arguments’
Tue Aug 11 18:19:03 2026 ===  0.000415 === uint32/useint32/sort.c compiler exited 1
Tue Aug 11 18:19:03 2026 ===  0.000126 === uint32/useint32/compiler.c compiling
Tue Aug 11 18:19:03 2026 ===  0.156356 === output
> gcc: error: unrecognized command-line option ‘-Qunused-arguments’
Tue Aug 11 18:19:03 2026 ===  0.000414 === uint32/useint32/compiler.c compiler exited 1
Tue Aug 11 18:19:03 2026 ===  0.000108 === uint32/useint32/version.c compiling
Tue Aug 11 18:19:03 2026 ===  0.234083 === output
> gcc: error: unrecognized command-line option ‘-Qunused-arguments’
Tue Aug 11 18:19:03 2026 ===  0.000343 === uint32/useint32/version.c compiler exited 1
Tue Aug 11 18:19:03 2026 ===  0.000100 === uint32/useint32/implementation.c compiling
Tue Aug 11 18:19:03 2026 ===  0.033538 === output
> gcc: error: unrecognized command-line option ‘-Qunused-arguments’
Tue Aug 11 18:19:03 2026 ===  0.000403 === uint32/useint32/implementation.c compiler exited 1
Tue Aug 11 18:19:03 2026 ===  0.000116 === uint32/useint32/cycles.c compiling
Tue Aug 11 18:19:03 2026 ===  0.038171 === output
> gcc: error: unrecognized command-line option ‘-Qunused-arguments’
Tue Aug 11 18:19:03 2026 ===  0.000395 === uint32/useint32/cycles.c compiler exited 1
Tue Aug 11 18:19:03 2026 ===  0.000106 === uint32/useint32/works.c compiling
Tue Aug 11 18:19:03 2026 ===  0.032985 === output
> gcc: error: unrecognized command-line option ‘-Qunused-arguments’
Tue Aug 11 18:19:03 2026 ===  0.000366 === uint32/useint32/works.c compiler exited 1
Tue Aug 11 18:19:03 2026 ===  0.000095 === uint32/useint32 compiling clang -fPIC -Wall -fomit-frame-pointer -fwrapv -Qunused-arguments -mavx2 -O3
Tue Aug 11 18:19:03 2026 ===  0.000181 === uint32/useint32/sort.c compiling
Tue Aug 11 18:19:03 2026 ===  0.081292 === output
> gcc: error: unrecognized command-line option ‘-Qunused-arguments’
Tue Aug 11 18:19:03 2026 ===  0.000368 === uint32/useint32/sort.c compiler exited 1
Tue Aug 11 18:19:03 2026 ===  0.000100 === uint32/useint32/compiler.c compiling
Tue Aug 11 18:19:03 2026 ===  0.032014 === output
> gcc: error: unrecognized command-line option ‘-Qunused-arguments’
Tue Aug 11 18:19:03 2026 ===  0.000368 === uint32/useint32/compiler.c compiler exited 1
Tue Aug 11 18:19:03 2026 ===  0.000099 === uint32/useint32/version.c compiling
Tue Aug 11 18:19:03 2026 ===  0.031379 === output
> gcc: error: unrecognized command-line option ‘-Qunused-arguments’
Tue Aug 11 18:19:03 2026 ===  0.000370 === uint32/useint32/version.c compiler exited 1
Tue Aug 11 18:19:03 2026 ===  0.000102 === uint32/useint32/implementation.c compiling
Tue Aug 11 18:19:03 2026 ===  0.034396 === output
> gcc: error: unrecognized command-line option ‘-Qunused-arguments’
Tue Aug 11 18:19:03 2026 ===  0.000445 === uint32/useint32/implementation.c compiler exited 1
Tue Aug 11 18:19:03 2026 ===  0.000128 === uint32/useint32/cycles.c compiling
Tue Aug 11 18:19:04 2026 ===  0.223435 === output
> gcc: error: unrecognized command-line option ‘-Qunused-arguments’
Tue Aug 11 18:19:04 2026 ===  0.000380 === uint32/useint32/cycles.c compiler exited 1
Tue Aug 11 18:19:04 2026 ===  0.000111 === uint32/useint32/works.c compiling
Tue Aug 11 18:19:04 2026 ===  0.061530 === output
> gcc: error: unrecognized command-line option ‘-Qunused-arguments’
Tue Aug 11 18:19:04 2026 ===  0.000412 === uint32/useint32/works.c compiler exited 1
Tue Aug 11 18:19:04 2026 ===  0.001779 === float32/useint32 compiling gcc -fPIC -Wall -fomit-frame-pointer -fwrapv -O3
Tue Aug 11 18:19:04 2026 ===  0.000163 === float32/useint32/sort.c compiling
Tue Aug 11 18:19:04 2026 ===  0.145752 === float32/useint32/compiler.c compiling
Tue Aug 11 18:19:04 2026 ===  0.024595 === float32/useint32/version.c compiling
Tue Aug 11 18:19:04 2026 ===  0.026196 === float32/useint32/implementation.c compiling
Tue Aug 11 18:19:04 2026 ===  0.024425 === float32/useint32/cycles.c compiling
Tue Aug 11 18:19:04 2026 ===  0.293283 === float32/useint32/works.c compiling
Tue Aug 11 18:19:04 2026 ===  0.129581 === float32/useint32 compiled gcc -fPIC -Wall -fomit-frame-pointer -fwrapv -O3
Tue Aug 11 18:19:04 2026 ===  0.129002 === float32/useint32 compiling gcc -fPIC -Wall -fomit-frame-pointer -fwrapv -march=core-avx2 -O3
Tue Aug 11 18:19:04 2026 ===  0.000290 === float32/useint32/sort.c compiling
Tue Aug 11 18:19:05 2026 ===  0.634424 === float32/useint32/compiler.c compiling
Tue Aug 11 18:19:05 2026 ===  0.026313 === float32/useint32/version.c compiling
Tue Aug 11 18:19:05 2026 ===  0.230672 === float32/useint32/implementation.c compiling
Tue Aug 11 18:19:05 2026 ===  0.027076 === float32/useint32/cycles.c compiling
Tue Aug 11 18:19:06 2026 ===  0.170950 === float32/useint32/works.c compiling
Tue Aug 11 18:19:06 2026 ===  0.112268 === float32/useint32 compiled gcc -fPIC -Wall -fomit-frame-pointer -fwrapv -march=core-avx2 -O3
Tue Aug 11 18:19:06 2026 ===  0.016540 === float32/useint32 compiling clang -fPIC -Wall -fomit-frame-pointer -fwrapv -Qunused-arguments -O3
Tue Aug 11 18:19:06 2026 ===  0.000264 === float32/useint32/sort.c compiling
Tue Aug 11 18:19:06 2026 ===  0.033377 === output
> gcc: error: unrecognized command-line option ‘-Qunused-arguments’
Tue Aug 11 18:19:06 2026 ===  0.000424 === float32/useint32/sort.c compiler exited 1
Tue Aug 11 18:19:06 2026 ===  0.000109 === float32/useint32/compiler.c compiling
Tue Aug 11 18:19:06 2026 ===  0.035184 === output
> gcc: error: unrecognized command-line option ‘-Qunused-arguments’
Tue Aug 11 18:19:06 2026 ===  0.000440 === float32/useint32/compiler.c compiler exited 1
Tue Aug 11 18:19:06 2026 ===  0.000123 === float32/useint32/version.c compiling
Tue Aug 11 18:19:06 2026 ===  0.034427 === output
> gcc: error: unrecognized command-line option ‘-Qunused-arguments’
Tue Aug 11 18:19:06 2026 ===  0.000388 === float32/useint32/version.c compiler exited 1
Tue Aug 11 18:19:06 2026 ===  0.000124 === float32/useint32/implementation.c compiling
Tue Aug 11 18:19:06 2026 ===  0.032714 === output
> gcc: error: unrecognized command-line option ‘-Qunused-arguments’
Tue Aug 11 18:19:06 2026 ===  0.000408 === float32/useint32/implementation.c compiler exited 1
Tue Aug 11 18:19:06 2026 ===  0.000121 === float32/useint32/cycles.c compiling
Tue Aug 11 18:19:06 2026 ===  0.033892 === output
> gcc: error: unrecognized command-line option ‘-Qunused-arguments’
Tue Aug 11 18:19:06 2026 ===  0.000409 === float32/useint32/cycles.c compiler exited 1
Tue Aug 11 18:19:06 2026 ===  0.000111 === float32/useint32/works.c compiling
Tue Aug 11 18:19:06 2026 ===  0.032681 === output
> gcc: error: unrecognized command-line option ‘-Qunused-arguments’
Tue Aug 11 18:19:06 2026 ===  0.000435 === float32/useint32/works.c compiler exited 1
Tue Aug 11 18:19:06 2026 ===  0.000122 === float32/useint32 compiling clang -fPIC -Wall -fomit-frame-pointer -fwrapv -Qunused-arguments -mavx2 -O3
Tue Aug 11 18:19:06 2026 ===  0.000264 === float32/useint32/sort.c compiling
Tue Aug 11 18:19:06 2026 ===  0.030333 === output
> gcc: error: unrecognized command-line option ‘-Qunused-arguments’
Tue Aug 11 18:19:06 2026 ===  0.000423 === float32/useint32/sort.c compiler exited 1
Tue Aug 11 18:19:06 2026 ===  0.000123 === float32/useint32/compiler.c compiling
Tue Aug 11 18:19:06 2026 ===  0.043202 === output
> gcc: error: unrecognized command-line option ‘-Qunused-arguments’
Tue Aug 11 18:19:06 2026 ===  0.000410 === float32/useint32/compiler.c compiler exited 1
Tue Aug 11 18:19:06 2026 ===  0.000108 === float32/useint32/version.c compiling
Tue Aug 11 18:19:06 2026 ===  0.037668 === output
> gcc: error: unrecognized command-line option ‘-Qunused-arguments’
Tue Aug 11 18:19:06 2026 ===  0.000392 === float32/useint32/version.c compiler exited 1
Tue Aug 11 18:19:06 2026 ===  0.000106 === float32/useint32/implementation.c compiling
Tue Aug 11 18:19:06 2026 ===  0.031967 === output
> gcc: error: unrecognized command-line option ‘-Qunused-arguments’
Tue Aug 11 18:19:06 2026 ===  0.000411 === float32/useint32/implementation.c compiler exited 1
Tue Aug 11 18:19:06 2026 ===  0.000131 === float32/useint32/cycles.c compiling
Tue Aug 11 18:19:06 2026 ===  0.035175 === output
> gcc: error: unrecognized command-line option ‘-Qunused-arguments’
Tue Aug 11 18:19:06 2026 ===  0.000364 === float32/useint32/cycles.c compiler exited 1
Tue Aug 11 18:19:06 2026 ===  0.000095 === float32/useint32/works.c compiling
Tue Aug 11 18:19:06 2026 ===  0.033284 === output
> gcc: error: unrecognized command-line option ‘-Qunused-arguments’
Tue Aug 11 18:19:06 2026 ===  0.000400 === float32/useint32/works.c compiler exited 1
Tue Aug 11 18:19:06 2026 ===  0.000164 === command/limits.c compiling gcc -fPIC -Wall -fomit-frame-pointer -fwrapv -O3
Tue Aug 11 18:19:06 2026 ===  0.050636 === command/limits.c compiling gcc -fPIC -Wall -fomit-frame-pointer -fwrapv -march=core-avx2 -O3
Tue Aug 11 18:19:06 2026 ===  0.054801 === command/limits.c compiling clang -fPIC -Wall -fomit-frame-pointer -fwrapv -Qunused-arguments -O3
Tue Aug 11 18:19:06 2026 ===  0.049550 === output
> gcc: error: unrecognized command-line option ‘-Qunused-arguments’
Tue Aug 11 18:19:06 2026 ===  0.000366 === command/limits.c compiler exited 1
Tue Aug 11 18:19:06 2026 ===  0.000108 === command/limits.c compiling clang -fPIC -Wall -fomit-frame-pointer -fwrapv -Qunused-arguments -mavx2 -O3
Tue Aug 11 18:19:06 2026 ===  0.121205 === output
> gcc: error: unrecognized command-line option ‘-Qunused-arguments’
Tue Aug 11 18:19:06 2026 ===  0.000350 === command/limits.c compiler exited 1
Tue Aug 11 18:19:06 2026 ===  0.000733 === command/int32-speed.c compiling gcc -fPIC -Wall -fomit-frame-pointer -fwrapv -O3
Tue Aug 11 18:19:07 2026 ===  0.600563 === command/int32-speed.c compiling gcc -fPIC -Wall -fomit-frame-pointer -fwrapv -march=core-avx2 -O3
Tue Aug 11 18:19:07 2026 ===  0.242004 === command/int32-speed.c compiling clang -fPIC -Wall -fomit-frame-pointer -fwrapv -Qunused-arguments -O3
Tue Aug 11 18:19:07 2026 ===  0.033216 === output
> gcc: error: unrecognized command-line option ‘-Qunused-arguments’
Tue Aug 11 18:19:07 2026 ===  0.000372 === command/int32-speed.c compiler exited 1
Tue Aug 11 18:19:07 2026 ===  0.000109 === command/int32-speed.c compiling clang -fPIC -Wall -fomit-frame-pointer -fwrapv -Qunused-arguments -mavx2 -O3
Tue Aug 11 18:19:07 2026 ===  0.034368 === output
> gcc: error: unrecognized command-line option ‘-Qunused-arguments’
Tue Aug 11 18:19:07 2026 ===  0.000402 === command/int32-speed.c compiler exited 1
Tue Aug 11 18:19:07 2026 ===  0.000775 === command/uint32-speed.c compiling gcc -fPIC -Wall -fomit-frame-pointer -fwrapv -O3
Tue Aug 11 18:19:08 2026 ===  0.295770 === command/uint32-speed.c compiling gcc -fPIC -Wall -fomit-frame-pointer -fwrapv -march=core-avx2 -O3
Tue Aug 11 18:19:08 2026 ===  0.110996 === command/uint32-speed.c compiling clang -fPIC -Wall -fomit-frame-pointer -fwrapv -Qunused-arguments -O3
Tue Aug 11 18:19:08 2026 ===  0.401186 === output
> gcc: error: unrecognized command-line option ‘-Qunused-arguments’
Tue Aug 11 18:19:08 2026 ===  0.000372 === command/uint32-speed.c compiler exited 1
Tue Aug 11 18:19:08 2026 ===  0.000090 === command/uint32-speed.c compiling clang -fPIC -Wall -fomit-frame-pointer -fwrapv -Qunused-arguments -mavx2 -O3
Tue Aug 11 18:19:08 2026 ===  0.032104 === output
> gcc: error: unrecognized command-line option ‘-Qunused-arguments’
Tue Aug 11 18:19:08 2026 ===  0.000379 === command/uint32-speed.c compiler exited 1
Tue Aug 11 18:19:08 2026 ===  0.000716 === command/float32-speed.c compiling gcc -fPIC -Wall -fomit-frame-pointer -fwrapv -O3
Tue Aug 11 18:19:08 2026 ===  0.260484 === command/float32-speed.c compiling gcc -fPIC -Wall -fomit-frame-pointer -fwrapv -march=core-avx2 -O3
Tue Aug 11 18:19:09 2026 ===  0.276331 === command/float32-speed.c compiling clang -fPIC -Wall -fomit-frame-pointer -fwrapv -Qunused-arguments -O3
Tue Aug 11 18:19:09 2026 ===  0.032476 === output
> gcc: error: unrecognized command-line option ‘-Qunused-arguments’
Tue Aug 11 18:19:09 2026 ===  0.000351 === command/float32-speed.c compiler exited 1
Tue Aug 11 18:19:09 2026 ===  0.000081 === command/float32-speed.c compiling clang -fPIC -Wall -fomit-frame-pointer -fwrapv -Qunused-arguments -mavx2 -O3
Tue Aug 11 18:19:09 2026 ===  0.032271 === output
> gcc: error: unrecognized command-line option ‘-Qunused-arguments’
Tue Aug 11 18:19:09 2026 ===  0.000339 === command/float32-speed.c compiler exited 1
Tue Aug 11 18:19:09 2026 ===  0.000303 === build finishing successfully
