Thu Aug 13 15:02:03 2026 ===  0.000000 === build starting
Thu Aug 13 15:02:03 2026 ===  0.000072 === version 20190516
Thu Aug 13 15:02:03 2026 ===  0.000036 === hostname pkgsrchostname
Thu Aug 13 15:02:03 2026 ===  0.000202 === compilers/abiname.c compiling gcc -fPIC -Wall -fomit-frame-pointer -fwrapv -O3
Thu Aug 13 15:02:03 2026 ===  0.071744 === compilers/abiname.c compiling gcc -fPIC -Wall -fomit-frame-pointer -fwrapv -march=core-avx2 -O3
Thu Aug 13 15:02:03 2026 ===  0.089733 === compilers/abiname.c compiling clang -fPIC -Wall -fomit-frame-pointer -fwrapv -Qunused-arguments -O3
Thu Aug 13 15:02:03 2026 ===  0.018264 === output
> gcc: error: unrecognized command-line option ‘-Qunused-arguments’
Thu Aug 13 15:02:03 2026 ===  0.000393 === compilers/abiname.c compiler exited 1
Thu Aug 13 15:02:03 2026 ===  0.017719 === output
> gcc: error: unrecognized command-line option ‘-Qunused-arguments’
Thu Aug 13 15:02:03 2026 ===  0.000326 === compilers/base.c compiler exited 1
Thu Aug 13 15:02:03 2026 ===  0.006547 === compilers/abiname.c compiling clang -fPIC -Wall -fomit-frame-pointer -fwrapv -Qunused-arguments -mavx2 -O3
Thu Aug 13 15:02:03 2026 ===  0.014104 === output
> gcc: error: unrecognized command-line option ‘-Qunused-arguments’
Thu Aug 13 15:02:03 2026 ===  0.000364 === compilers/abiname.c compiler exited 1
Thu Aug 13 15:02:03 2026 ===  0.020173 === output
> gcc: error: unrecognized command-line option ‘-Qunused-arguments’
Thu Aug 13 15:02:03 2026 ===  0.000332 === compilers/base.c compiler exited 1
Thu Aug 13 15:02:03 2026 ===  0.006163 === cpucycles/amd64cpuinfo compiling gcc -fPIC -Wall -fomit-frame-pointer -fwrapv -O3
Thu Aug 13 15:02:03 2026 ===  0.055408 === output
> cpucycles.c: In function ‘djbsort_cpucycles’:
> cpucycles.c:10:3: error: inconsistent operand constraints in an ‘asm’
>    10 |   asm volatile(".byte 15;.byte 49;shlq $32,%%rdx;orq %%rdx,%%rax"
>       |   ^~~
Thu Aug 13 15:02:03 2026 ===  0.000400 === cpucycles/cpucycles.c compiler exited 1
Thu Aug 13 15:02:03 2026 ===  0.000071 === cpucycles/amd64cpuinfo compiling gcc -fPIC -Wall -fomit-frame-pointer -fwrapv -march=core-avx2 -O3
Thu Aug 13 15:02:03 2026 ===  0.036845 === output
> cpucycles.c: In function ‘djbsort_cpucycles’:
> cpucycles.c:10:3: error: inconsistent operand constraints in an ‘asm’
>    10 |   asm volatile(".byte 15;.byte 49;shlq $32,%%rdx;orq %%rdx,%%rax"
>       |   ^~~
Thu Aug 13 15:02:03 2026 ===  0.001223 === cpucycles/cpucycles.c compiler exited 1
Thu Aug 13 15:02:03 2026 ===  0.000101 === cpucycles/amd64cpuinfo compiling clang -fPIC -Wall -fomit-frame-pointer -fwrapv -Qunused-arguments -O3
Thu Aug 13 15:02:03 2026 ===  0.023550 === output
> gcc: error: unrecognized command-line option ‘-Qunused-arguments’
Thu Aug 13 15:02:03 2026 ===  0.000354 === cpucycles/cpucycles.c compiler exited 1
Thu Aug 13 15:02:03 2026 ===  0.000084 === cpucycles/amd64cpuinfo compiling clang -fPIC -Wall -fomit-frame-pointer -fwrapv -Qunused-arguments -mavx2 -O3
Thu Aug 13 15:02:03 2026 ===  0.018725 === output
> gcc: error: unrecognized command-line option ‘-Qunused-arguments’
Thu Aug 13 15:02:03 2026 ===  0.000360 === cpucycles/cpucycles.c compiler exited 1
Thu Aug 13 15:02:03 2026 ===  0.000113 === cpucycles/amd64cpuspeed compiling gcc -fPIC -Wall -fomit-frame-pointer -fwrapv -O3
Thu Aug 13 15:02:03 2026 ===  0.032093 === output
> cpucycles.c: In function ‘djbsort_cpucycles_persecond’:
> cpucycles.c:21:12: error: ‘HW_CPUSPEED’ undeclared (first use in this function)
>    21 |   oid[1] = HW_CPUSPEED;
>       |            ^~~~~~~~~~~
> cpucycles.c:21:12: note: each undeclared identifier is reported only once for each function it appears in
Thu Aug 13 15:02:03 2026 ===  0.000367 === cpucycles/cpucycles.c compiler exited 1
Thu Aug 13 15:02:03 2026 ===  0.000080 === cpucycles/amd64cpuspeed compiling gcc -fPIC -Wall -fomit-frame-pointer -fwrapv -march=core-avx2 -O3
Thu Aug 13 15:02:03 2026 ===  0.029879 === output
> cpucycles.c: In function ‘djbsort_cpucycles_persecond’:
> cpucycles.c:21:12: error: ‘HW_CPUSPEED’ undeclared (first use in this function)
>    21 |   oid[1] = HW_CPUSPEED;
>       |            ^~~~~~~~~~~
> cpucycles.c:21:12: note: each undeclared identifier is reported only once for each function it appears in
Thu Aug 13 15:02:03 2026 ===  0.000393 === cpucycles/cpucycles.c compiler exited 1
Thu Aug 13 15:02:03 2026 ===  0.000087 === cpucycles/amd64cpuspeed compiling clang -fPIC -Wall -fomit-frame-pointer -fwrapv -Qunused-arguments -O3
Thu Aug 13 15:02:03 2026 ===  0.017391 === output
> gcc: error: unrecognized command-line option ‘-Qunused-arguments’
Thu Aug 13 15:02:03 2026 ===  0.000371 === cpucycles/cpucycles.c compiler exited 1
Thu Aug 13 15:02:03 2026 ===  0.000092 === cpucycles/amd64cpuspeed compiling clang -fPIC -Wall -fomit-frame-pointer -fwrapv -Qunused-arguments -mavx2 -O3
Thu Aug 13 15:02:03 2026 ===  0.017897 === output
> gcc: error: unrecognized command-line option ‘-Qunused-arguments’
Thu Aug 13 15:02:03 2026 ===  0.000269 === cpucycles/cpucycles.c compiler exited 1
Thu Aug 13 15:02:03 2026 ===  0.000074 === cpucycles/amd64tscfreq compiling gcc -fPIC -Wall -fomit-frame-pointer -fwrapv -O3
Thu Aug 13 15:02:03 2026 ===  0.048228 === output
> cpucycles.c: In function ‘djbsort_cpucycles_persecond’:
> cpucycles.c:17:3: warning: implicit declaration of function ‘sysctlbyname’ [-Wimplicit-function-declaration]
>    17 |   sysctlbyname("machdep.tsc_freq",&result,&resultlen,0,0);
>       |   ^~~~~~~~~~~~
> cpucycles.c: In function ‘djbsort_cpucycles’:
> cpucycles.c:8:3: error: inconsistent operand constraints in an ‘asm’
>     8 |   asm volatile(".byte 15;.byte 49;shlq $32,%%rdx;orq %%rdx,%%rax"
>       |   ^~~
Thu Aug 13 15:02:03 2026 ===  0.000342 === cpucycles/cpucycles.c compiler exited 1
Thu Aug 13 15:02:03 2026 ===  0.000058 === cpucycles/amd64tscfreq compiling gcc -fPIC -Wall -fomit-frame-pointer -fwrapv -march=core-avx2 -O3
Thu Aug 13 15:02:03 2026 ===  0.037234 === output
> cpucycles.c: In function ‘djbsort_cpucycles_persecond’:
> cpucycles.c:17:3: warning: implicit declaration of function ‘sysctlbyname’ [-Wimplicit-function-declaration]
>    17 |   sysctlbyname("machdep.tsc_freq",&result,&resultlen,0,0);
>       |   ^~~~~~~~~~~~
> cpucycles.c: In function ‘djbsort_cpucycles’:
> cpucycles.c:8:3: error: inconsistent operand constraints in an ‘asm’
>     8 |   asm volatile(".byte 15;.byte 49;shlq $32,%%rdx;orq %%rdx,%%rax"
>       |   ^~~
Thu Aug 13 15:02:03 2026 ===  0.000337 === cpucycles/cpucycles.c compiler exited 1
Thu Aug 13 15:02:03 2026 ===  0.000058 === cpucycles/amd64tscfreq compiling clang -fPIC -Wall -fomit-frame-pointer -fwrapv -Qunused-arguments -O3
Thu Aug 13 15:02:03 2026 ===  0.033631 === output
> gcc: error: unrecognized command-line option ‘-Qunused-arguments’
Thu Aug 13 15:02:03 2026 ===  0.000349 === cpucycles/cpucycles.c compiler exited 1
Thu Aug 13 15:02:03 2026 ===  0.000093 === cpucycles/amd64tscfreq compiling clang -fPIC -Wall -fomit-frame-pointer -fwrapv -Qunused-arguments -mavx2 -O3
Thu Aug 13 15:02:03 2026 ===  0.016863 === output
> gcc: error: unrecognized command-line option ‘-Qunused-arguments’
Thu Aug 13 15:02:03 2026 ===  0.000320 === cpucycles/cpucycles.c compiler exited 1
Thu Aug 13 15:02:03 2026 ===  0.000093 === cpucycles/apple compiling gcc -fPIC -Wall -fomit-frame-pointer -fwrapv -O3
Thu Aug 13 15:02:03 2026 ===  0.032255 === output
> cpucycles.c:6:10: fatal error: mach/mach_time.h: No such file or directory
>     6 | #include <mach/mach_time.h>
>       |          ^~~~~~~~~~~~~~~~~~
> compilation terminated.
Thu Aug 13 15:02:03 2026 ===  0.000401 === cpucycles/cpucycles.c compiler exited 1
Thu Aug 13 15:02:03 2026 ===  0.000089 === cpucycles/apple compiling gcc -fPIC -Wall -fomit-frame-pointer -fwrapv -march=core-avx2 -O3
Thu Aug 13 15:02:03 2026 ===  0.038065 === output
> cpucycles.c:6:10: fatal error: mach/mach_time.h: No such file or directory
>     6 | #include <mach/mach_time.h>
>       |          ^~~~~~~~~~~~~~~~~~
> compilation terminated.
Thu Aug 13 15:02:03 2026 ===  0.000345 === cpucycles/cpucycles.c compiler exited 1
Thu Aug 13 15:02:03 2026 ===  0.000096 === cpucycles/apple compiling clang -fPIC -Wall -fomit-frame-pointer -fwrapv -Qunused-arguments -O3
Thu Aug 13 15:02:03 2026 ===  0.020740 === output
> gcc: error: unrecognized command-line option ‘-Qunused-arguments’
Thu Aug 13 15:02:03 2026 ===  0.000352 === cpucycles/cpucycles.c compiler exited 1
Thu Aug 13 15:02:03 2026 ===  0.000088 === cpucycles/apple compiling clang -fPIC -Wall -fomit-frame-pointer -fwrapv -Qunused-arguments -mavx2 -O3
Thu Aug 13 15:02:03 2026 ===  0.021583 === output
> gcc: error: unrecognized command-line option ‘-Qunused-arguments’
Thu Aug 13 15:02:03 2026 ===  0.000368 === cpucycles/cpucycles.c compiler exited 1
Thu Aug 13 15:02:03 2026 ===  0.000116 === cpucycles/celllinux compiling gcc -fPIC -Wall -fomit-frame-pointer -fwrapv -O3
Thu Aug 13 15:02:03 2026 ===  0.031169 === output
> cpucycles.c:6:10: fatal error: spu_mfcio.h: No such file or directory
>     6 | #include <spu_mfcio.h>
>       |          ^~~~~~~~~~~~~
> compilation terminated.
Thu Aug 13 15:02:03 2026 ===  0.000351 === cpucycles/cpucycles.c compiler exited 1
Thu Aug 13 15:02:03 2026 ===  0.000093 === cpucycles/celllinux compiling gcc -fPIC -Wall -fomit-frame-pointer -fwrapv -march=core-avx2 -O3
Thu Aug 13 15:02:03 2026 ===  0.033231 === output
> cpucycles.c:6:10: fatal error: spu_mfcio.h: No such file or directory
>     6 | #include <spu_mfcio.h>
>       |          ^~~~~~~~~~~~~
> compilation terminated.
Thu Aug 13 15:02:03 2026 ===  0.000376 === cpucycles/cpucycles.c compiler exited 1
Thu Aug 13 15:02:03 2026 ===  0.000092 === cpucycles/celllinux compiling clang -fPIC -Wall -fomit-frame-pointer -fwrapv -Qunused-arguments -O3
Thu Aug 13 15:02:03 2026 ===  0.025265 === output
> gcc: error: unrecognized command-line option ‘-Qunused-arguments’
Thu Aug 13 15:02:03 2026 ===  0.000388 === cpucycles/cpucycles.c compiler exited 1
Thu Aug 13 15:02:03 2026 ===  0.000101 === cpucycles/celllinux compiling clang -fPIC -Wall -fomit-frame-pointer -fwrapv -Qunused-arguments -mavx2 -O3
Thu Aug 13 15:02:03 2026 ===  0.029512 === output
> gcc: error: unrecognized command-line option ‘-Qunused-arguments’
Thu Aug 13 15:02:03 2026 ===  0.000373 === cpucycles/cpucycles.c compiler exited 1
Thu Aug 13 15:02:03 2026 ===  0.000104 === cpucycles/cortex compiling gcc -fPIC -Wall -fomit-frame-pointer -fwrapv -O3
Thu Aug 13 15:02:03 2026 ===  0.064345 === output
> cpucycles.c: Assembler messages:
> cpucycles.c:59: Error: no such instruction: `mcr p15,0,%eax,c9,c12,0'
> cpucycles.c:60: Error: no such instruction: `mcr p15,0,%eax,c9,c12,1'
> cpucycles.c:61: Error: no such instruction: `mcr p15,0,%eax,c9,c12,3'
> cpucycles.c:64: Error: no such instruction: `mrc p15,0,%edi,c9,c13,0'
Thu Aug 13 15:02:03 2026 ===  0.000359 === cpucycles/cpucycles.c compiler exited 1
Thu Aug 13 15:02:03 2026 ===  0.000083 === cpucycles/cortex compiling gcc -fPIC -Wall -fomit-frame-pointer -fwrapv -march=core-avx2 -O3
Thu Aug 13 15:02:04 2026 ===  0.089810 === output
> cpucycles.c: Assembler messages:
> cpucycles.c:59: Error: no such instruction: `mcr p15,0,%eax,c9,c12,0'
> cpucycles.c:60: Error: no such instruction: `mcr p15,0,%eax,c9,c12,1'
> cpucycles.c:61: Error: no such instruction: `mcr p15,0,%eax,c9,c12,3'
> cpucycles.c:64: Error: no such instruction: `mrc p15,0,%esi,c9,c13,0'
Thu Aug 13 15:02:04 2026 ===  0.000308 === cpucycles/cpucycles.c compiler exited 1
Thu Aug 13 15:02:04 2026 ===  0.000076 === cpucycles/cortex compiling clang -fPIC -Wall -fomit-frame-pointer -fwrapv -Qunused-arguments -O3
Thu Aug 13 15:02:04 2026 ===  0.020016 === output
> gcc: error: unrecognized command-line option ‘-Qunused-arguments’
Thu Aug 13 15:02:04 2026 ===  0.000386 === cpucycles/cpucycles.c compiler exited 1
Thu Aug 13 15:02:04 2026 ===  0.000089 === cpucycles/cortex compiling clang -fPIC -Wall -fomit-frame-pointer -fwrapv -Qunused-arguments -mavx2 -O3
Thu Aug 13 15:02:04 2026 ===  0.020671 === output
> gcc: error: unrecognized command-line option ‘-Qunused-arguments’
Thu Aug 13 15:02:04 2026 ===  0.000386 === cpucycles/cpucycles.c compiler exited 1
Thu Aug 13 15:02:04 2026 ===  0.000133 === cpucycles/cortex_vct compiling gcc -fPIC -Wall -fomit-frame-pointer -fwrapv -O3
Thu Aug 13 15:02:04 2026 ===  0.051025 === output
> cpucycles.c: In function ‘djbsort_cpucycles’:
> cpucycles.c:27:1: warning: unsupported size for integer register
>    27 | }
>       | ^
> cpucycles.c: In function ‘djbsort_cpucycles_persecond’:
> cpucycles.c:49:1: warning: unsupported size for integer register
>    49 | }
>       | ^
> cpucycles.c: Assembler messages:
> cpucycles.c:25: Error: no such instruction: `mrs %eax,CNTVCT_EL0'
> cpucycles.c:17: Error: no such instruction: `mrs %esi,CNTFRQ_EL0'
Thu Aug 13 15:02:04 2026 ===  0.000402 === cpucycles/cpucycles.c compiler exited 1
Thu Aug 13 15:02:04 2026 ===  0.000081 === cpucycles/cortex_vct compiling gcc -fPIC -Wall -fomit-frame-pointer -fwrapv -march=core-avx2 -O3
Thu Aug 13 15:02:04 2026 ===  0.051565 === output
> cpucycles.c: In function ‘djbsort_cpucycles’:
> cpucycles.c:27:1: warning: unsupported size for integer register
>    27 | }
>       | ^
> cpucycles.c: In function ‘djbsort_cpucycles_persecond’:
> cpucycles.c:49:1: warning: unsupported size for integer register
>    49 | }
>       | ^
> cpucycles.c: Assembler messages:
> cpucycles.c:25: Error: no such instruction: `mrs %eax,CNTVCT_EL0'
> cpucycles.c:17: Error: no such instruction: `mrs %eax,CNTFRQ_EL0'
Thu Aug 13 15:02:04 2026 ===  0.000363 === cpucycles/cpucycles.c compiler exited 1
Thu Aug 13 15:02:04 2026 ===  0.000068 === cpucycles/cortex_vct compiling clang -fPIC -Wall -fomit-frame-pointer -fwrapv -Qunused-arguments -O3
Thu Aug 13 15:02:04 2026 ===  0.018928 === output
> gcc: error: unrecognized command-line option ‘-Qunused-arguments’
Thu Aug 13 15:02:04 2026 ===  0.000346 === cpucycles/cpucycles.c compiler exited 1
Thu Aug 13 15:02:04 2026 ===  0.000082 === cpucycles/cortex_vct compiling clang -fPIC -Wall -fomit-frame-pointer -fwrapv -Qunused-arguments -mavx2 -O3
Thu Aug 13 15:02:04 2026 ===  0.018976 === output
> gcc: error: unrecognized command-line option ‘-Qunused-arguments’
Thu Aug 13 15:02:04 2026 ===  0.000363 === cpucycles/cpucycles.c compiler exited 1
Thu Aug 13 15:02:04 2026 ===  0.000111 === cpucycles/dev4ns compiling gcc -fPIC -Wall -fomit-frame-pointer -fwrapv -O3
Thu Aug 13 15:02:04 2026 ===  0.219146 === cpucycles/dev4ns compiling gcc -fPIC -Wall -fomit-frame-pointer -fwrapv -march=core-avx2 -O3
Thu Aug 13 15:02:04 2026 ===  0.226997 === cpucycles/dev4ns compiling clang -fPIC -Wall -fomit-frame-pointer -fwrapv -Qunused-arguments -O3
Thu Aug 13 15:02:04 2026 ===  0.024486 === output
> gcc: error: unrecognized command-line option ‘-Qunused-arguments’
Thu Aug 13 15:02:04 2026 ===  0.000362 === cpucycles/cpucycles.c compiler exited 1
Thu Aug 13 15:02:04 2026 ===  0.000092 === cpucycles/dev4ns compiling clang -fPIC -Wall -fomit-frame-pointer -fwrapv -Qunused-arguments -mavx2 -O3
Thu Aug 13 15:02:04 2026 ===  0.031205 === output
> gcc: error: unrecognized command-line option ‘-Qunused-arguments’
Thu Aug 13 15:02:04 2026 ===  0.000376 === cpucycles/cpucycles.c compiler exited 1
Thu Aug 13 15:02:04 2026 ===  0.000101 === cpucycles/gettimeofday compiling gcc -fPIC -Wall -fomit-frame-pointer -fwrapv -O3
Thu Aug 13 15:02:04 2026 ===  0.233377 === cpucycles/gettimeofday compiling gcc -fPIC -Wall -fomit-frame-pointer -fwrapv -march=core-avx2 -O3
Thu Aug 13 15:02:05 2026 ===  0.253775 === cpucycles/gettimeofday compiling clang -fPIC -Wall -fomit-frame-pointer -fwrapv -Qunused-arguments -O3
Thu Aug 13 15:02:05 2026 ===  0.021249 === output
> gcc: error: unrecognized command-line option ‘-Qunused-arguments’
Thu Aug 13 15:02:05 2026 ===  0.000374 === cpucycles/cpucycles.c compiler exited 1
Thu Aug 13 15:02:05 2026 ===  0.000083 === cpucycles/gettimeofday compiling clang -fPIC -Wall -fomit-frame-pointer -fwrapv -Qunused-arguments -mavx2 -O3
Thu Aug 13 15:02:05 2026 ===  0.021197 === output
> gcc: error: unrecognized command-line option ‘-Qunused-arguments’
Thu Aug 13 15:02:05 2026 ===  0.000348 === cpucycles/cpucycles.c compiler exited 1
Thu Aug 13 15:02:05 2026 ===  0.000103 === cpucycles/ia64cpuinfo compiling gcc -fPIC -Wall -fomit-frame-pointer -fwrapv -O3
Thu Aug 13 15:02:05 2026 ===  0.076212 === output
> cpucycles.c: In function ‘djbsort_cpucycles’:
> cpucycles.c:12:1: warning: unsupported size for integer register
>    12 | }
>       | ^
> cpucycles.c: Assembler messages:
> cpucycles.c:10: Error: invalid character '=' in operand 1
Thu Aug 13 15:02:05 2026 ===  0.000377 === cpucycles/cpucycles.c compiler exited 1
Thu Aug 13 15:02:05 2026 ===  0.000082 === cpucycles/ia64cpuinfo compiling gcc -fPIC -Wall -fomit-frame-pointer -fwrapv -march=core-avx2 -O3
Thu Aug 13 15:02:05 2026 ===  0.079662 === output
> cpucycles.c: In function ‘djbsort_cpucycles’:
> cpucycles.c:12:1: warning: unsupported size for integer register
>    12 | }
>       | ^
> cpucycles.c: Assembler messages:
> cpucycles.c:10: Error: invalid character '=' in operand 1
Thu Aug 13 15:02:05 2026 ===  0.000396 === cpucycles/cpucycles.c compiler exited 1
Thu Aug 13 15:02:05 2026 ===  0.000098 === cpucycles/ia64cpuinfo compiling clang -fPIC -Wall -fomit-frame-pointer -fwrapv -Qunused-arguments -O3
Thu Aug 13 15:02:05 2026 ===  0.020355 === output
> gcc: error: unrecognized command-line option ‘-Qunused-arguments’
Thu Aug 13 15:02:05 2026 ===  0.000357 === cpucycles/cpucycles.c compiler exited 1
Thu Aug 13 15:02:05 2026 ===  0.000087 === cpucycles/ia64cpuinfo compiling clang -fPIC -Wall -fomit-frame-pointer -fwrapv -Qunused-arguments -mavx2 -O3
Thu Aug 13 15:02:05 2026 ===  0.014157 === output
> gcc: error: unrecognized command-line option ‘-Qunused-arguments’
Thu Aug 13 15:02:05 2026 ===  0.000685 === cpucycles/cpucycles.c compiler exited 1
Thu Aug 13 15:02:05 2026 ===  0.000119 === cpucycles/mips compiling gcc -fPIC -Wall -fomit-frame-pointer -fwrapv -O3
Thu Aug 13 15:02:05 2026 ===  0.044597 === output
> cpucycles.c: In function ‘djbsort_cpucycles’:
> cpucycles.c:36:13: warning: pointer targets in passing argument 1 of ‘readticks’ differ in signedness [-Wpointer-sign]
>    36 |   readticks(now);
>       |             ^~~
>       |             |
>       |             int *
> cpucycles.c:18:37: note: expected ‘unsigned int *’ but argument is of type ‘int *’
>    18 | static void readticks(unsigned int *result)
>       |                       ~~~~~~~~~~~~~~^~~~~~
> cpucycles.c:22:3: error: unknown register name ‘$2’ in ‘asm’
>    22 |   asm volatile(".long 2080510011; move %0,$2" : "=r"(cc) : : "$2");
>       |   ^~~
Thu Aug 13 15:02:05 2026 ===  0.000373 === cpucycles/cpucycles.c compiler exited 1
Thu Aug 13 15:02:05 2026 ===  0.000083 === cpucycles/mips compiling gcc -fPIC -Wall -fomit-frame-pointer -fwrapv -march=core-avx2 -O3
Thu Aug 13 15:02:05 2026 ===  0.051017 === output
> cpucycles.c: In function ‘djbsort_cpucycles’:
> cpucycles.c:36:13: warning: pointer targets in passing argument 1 of ‘readticks’ differ in signedness [-Wpointer-sign]
>    36 |   readticks(now);
>       |             ^~~
>       |             |
>       |             int *
> cpucycles.c:18:37: note: expected ‘unsigned int *’ but argument is of type ‘int *’
>    18 | static void readticks(unsigned int *result)
>       |                       ~~~~~~~~~~~~~~^~~~~~
> cpucycles.c:22:3: error: unknown register name ‘$2’ in ‘asm’
>    22 |   asm volatile(".long 2080510011; move %0,$2" : "=r"(cc) : : "$2");
>       |   ^~~
Thu Aug 13 15:02:05 2026 ===  0.000359 === cpucycles/cpucycles.c compiler exited 1
Thu Aug 13 15:02:05 2026 ===  0.000074 === cpucycles/mips compiling clang -fPIC -Wall -fomit-frame-pointer -fwrapv -Qunused-arguments -O3
Thu Aug 13 15:02:05 2026 ===  0.021760 === output
> gcc: error: unrecognized command-line option ‘-Qunused-arguments’
Thu Aug 13 15:02:05 2026 ===  0.000359 === cpucycles/cpucycles.c compiler exited 1
Thu Aug 13 15:02:05 2026 ===  0.000090 === cpucycles/mips compiling clang -fPIC -Wall -fomit-frame-pointer -fwrapv -Qunused-arguments -mavx2 -O3
Thu Aug 13 15:02:05 2026 ===  0.020803 === output
> gcc: error: unrecognized command-line option ‘-Qunused-arguments’
Thu Aug 13 15:02:05 2026 ===  0.000368 === cpucycles/cpucycles.c compiler exited 1
Thu Aug 13 15:02:05 2026 ===  0.000127 === cpucycles/monotonic compiling gcc -fPIC -Wall -fomit-frame-pointer -fwrapv -O3
Thu Aug 13 15:02:05 2026 ===  0.167886 === cpucycles/monotonic compiling gcc -fPIC -Wall -fomit-frame-pointer -fwrapv -march=core-avx2 -O3
Thu Aug 13 15:02:05 2026 ===  0.223465 === cpucycles/monotonic compiling clang -fPIC -Wall -fomit-frame-pointer -fwrapv -Qunused-arguments -O3
Thu Aug 13 15:02:06 2026 ===  0.020515 === output
> gcc: error: unrecognized command-line option ‘-Qunused-arguments’
Thu Aug 13 15:02:06 2026 ===  0.000290 === cpucycles/cpucycles.c compiler exited 1
Thu Aug 13 15:02:06 2026 ===  0.000072 === cpucycles/monotonic compiling clang -fPIC -Wall -fomit-frame-pointer -fwrapv -Qunused-arguments -mavx2 -O3
Thu Aug 13 15:02:06 2026 ===  0.020393 === output
> gcc: error: unrecognized command-line option ‘-Qunused-arguments’
Thu Aug 13 15:02:06 2026 ===  0.000291 === cpucycles/cpucycles.c compiler exited 1
Thu Aug 13 15:02:06 2026 ===  0.000084 === cpucycles/monotoniccpuinfo compiling gcc -fPIC -Wall -fomit-frame-pointer -fwrapv -O3
Thu Aug 13 15:02:06 2026 ===  0.191698 === cpucycles/monotoniccpuinfo compiling gcc -fPIC -Wall -fomit-frame-pointer -fwrapv -march=core-avx2 -O3
Thu Aug 13 15:02:06 2026 ===  0.250824 === cpucycles/monotoniccpuinfo compiling clang -fPIC -Wall -fomit-frame-pointer -fwrapv -Qunused-arguments -O3
Thu Aug 13 15:02:06 2026 ===  0.014105 === output
> gcc: error: unrecognized command-line option ‘-Qunused-arguments’
Thu Aug 13 15:02:06 2026 ===  0.000356 === cpucycles/cpucycles.c compiler exited 1
Thu Aug 13 15:02:06 2026 ===  0.000100 === cpucycles/monotoniccpuinfo compiling clang -fPIC -Wall -fomit-frame-pointer -fwrapv -Qunused-arguments -mavx2 -O3
Thu Aug 13 15:02:06 2026 ===  0.020430 === output
> gcc: error: unrecognized command-line option ‘-Qunused-arguments’
Thu Aug 13 15:02:06 2026 ===  0.000532 === cpucycles/cpucycles.c compiler exited 1
Thu Aug 13 15:02:06 2026 ===  0.000133 === cpucycles/perfevent compiling gcc -fPIC -Wall -fomit-frame-pointer -fwrapv -O3
Thu Aug 13 15:02:06 2026 ===  0.031723 === output
> cpucycles.c:6:10: fatal error: linux/perf_event.h: No such file or directory
>     6 | #include <linux/perf_event.h>
>       |          ^~~~~~~~~~~~~~~~~~~~
> compilation terminated.
Thu Aug 13 15:02:06 2026 ===  0.000343 === cpucycles/cpucycles.c compiler exited 1
Thu Aug 13 15:02:06 2026 ===  0.000082 === cpucycles/perfevent compiling gcc -fPIC -Wall -fomit-frame-pointer -fwrapv -march=core-avx2 -O3
Thu Aug 13 15:02:06 2026 ===  0.034945 === output
> cpucycles.c:6:10: fatal error: linux/perf_event.h: No such file or directory
>     6 | #include <linux/perf_event.h>
>       |          ^~~~~~~~~~~~~~~~~~~~
> compilation terminated.
Thu Aug 13 15:02:06 2026 ===  0.000357 === cpucycles/cpucycles.c compiler exited 1
Thu Aug 13 15:02:06 2026 ===  0.000089 === cpucycles/perfevent compiling clang -fPIC -Wall -fomit-frame-pointer -fwrapv -Qunused-arguments -O3
Thu Aug 13 15:02:06 2026 ===  0.019762 === output
> gcc: error: unrecognized command-line option ‘-Qunused-arguments’
Thu Aug 13 15:02:06 2026 ===  0.000352 === cpucycles/cpucycles.c compiler exited 1
Thu Aug 13 15:02:06 2026 ===  0.000086 === cpucycles/perfevent compiling clang -fPIC -Wall -fomit-frame-pointer -fwrapv -Qunused-arguments -mavx2 -O3
Thu Aug 13 15:02:06 2026 ===  0.020930 === output
> gcc: error: unrecognized command-line option ‘-Qunused-arguments’
Thu Aug 13 15:02:06 2026 ===  0.000369 === cpucycles/cpucycles.c compiler exited 1
Thu Aug 13 15:02:06 2026 ===  0.000116 === cpucycles/powerpccpuinfo compiling gcc -fPIC -Wall -fomit-frame-pointer -fwrapv -O3
Thu Aug 13 15:02:06 2026 ===  0.120419 === output
> cpucycles.c: Assembler messages:
> cpucycles.c:35: Error: no such instruction: `mftbu %ecx'
> cpucycles.c:35: Error: no such instruction: `mftb %esi'
> cpucycles.c:35: Error: no such instruction: `mftbu %eax'
> cpucycles.c:35: Error: no such instruction: `mftbu %esi'
> cpucycles.c:35: Error: no such instruction: `mftb %edi'
> cpucycles.c:35: Error: no such instruction: `mftbu %eax'
> cpucycles.c:35: Error: no such instruction: `mftbu %ecx'
> cpucycles.c:35: Error: no such instruction: `mftb %edi'
> cpucycles.c:35: Error: no such instruction: `mftbu %eax'
Thu Aug 13 15:02:06 2026 ===  0.000392 === cpucycles/cpucycles.c compiler exited 1
Thu Aug 13 15:02:06 2026 ===  0.000104 === cpucycles/powerpccpuinfo compiling gcc -fPIC -Wall -fomit-frame-pointer -fwrapv -march=core-avx2 -O3
Thu Aug 13 15:02:06 2026 ===  0.150444 === output
> cpucycles.c: Assembler messages:
> cpucycles.c:35: Error: no such instruction: `mftbu %ecx'
> cpucycles.c:35: Error: no such instruction: `mftb %ebx'
> cpucycles.c:35: Error: no such instruction: `mftbu %eax'
> cpucycles.c:35: Error: no such instruction: `mftbu %esi'
> cpucycles.c:35: Error: no such instruction: `mftb %edi'
> cpucycles.c:35: Error: no such instruction: `mftbu %eax'
> cpucycles.c:35: Error: no such instruction: `mftbu %ecx'
> cpucycles.c:35: Error: no such instruction: `mftb %ebx'
> cpucycles.c:35: Error: no such instruction: `mftbu %eax'
Thu Aug 13 15:02:06 2026 ===  0.000316 === cpucycles/cpucycles.c compiler exited 1
Thu Aug 13 15:02:06 2026 ===  0.000084 === cpucycles/powerpccpuinfo compiling clang -fPIC -Wall -fomit-frame-pointer -fwrapv -Qunused-arguments -O3
Thu Aug 13 15:02:06 2026 ===  0.026842 === output
> gcc: error: unrecognized command-line option ‘-Qunused-arguments’
Thu Aug 13 15:02:06 2026 ===  0.000304 === cpucycles/cpucycles.c compiler exited 1
Thu Aug 13 15:02:06 2026 ===  0.000065 === cpucycles/powerpccpuinfo compiling clang -fPIC -Wall -fomit-frame-pointer -fwrapv -Qunused-arguments -mavx2 -O3
Thu Aug 13 15:02:06 2026 ===  0.021203 === output
> gcc: error: unrecognized command-line option ‘-Qunused-arguments’
Thu Aug 13 15:02:06 2026 ===  0.000323 === cpucycles/cpucycles.c compiler exited 1
Thu Aug 13 15:02:06 2026 ===  0.000092 === cpucycles/powerpcmacos compiling gcc -fPIC -Wall -fomit-frame-pointer -fwrapv -O3
Thu Aug 13 15:02:06 2026 ===  0.025884 === output
> cpucycles.c:3:10: fatal error: mach/mach_time.h: No such file or directory
>     3 | #include <mach/mach_time.h>
>       |          ^~~~~~~~~~~~~~~~~~
> compilation terminated.
Thu Aug 13 15:02:06 2026 ===  0.000354 === cpucycles/cpucycles.c compiler exited 1
Thu Aug 13 15:02:06 2026 ===  0.000075 === cpucycles/powerpcmacos compiling gcc -fPIC -Wall -fomit-frame-pointer -fwrapv -march=core-avx2 -O3
Thu Aug 13 15:02:07 2026 ===  0.029668 === output
> cpucycles.c:3:10: fatal error: mach/mach_time.h: No such file or directory
>     3 | #include <mach/mach_time.h>
>       |          ^~~~~~~~~~~~~~~~~~
> compilation terminated.
Thu Aug 13 15:02:07 2026 ===  0.000357 === cpucycles/cpucycles.c compiler exited 1
Thu Aug 13 15:02:07 2026 ===  0.000081 === cpucycles/powerpcmacos compiling clang -fPIC -Wall -fomit-frame-pointer -fwrapv -Qunused-arguments -O3
Thu Aug 13 15:02:07 2026 ===  0.020869 === output
> gcc: error: unrecognized command-line option ‘-Qunused-arguments’
Thu Aug 13 15:02:07 2026 ===  0.000360 === cpucycles/cpucycles.c compiler exited 1
Thu Aug 13 15:02:07 2026 ===  0.000084 === cpucycles/powerpcmacos compiling clang -fPIC -Wall -fomit-frame-pointer -fwrapv -Qunused-arguments -mavx2 -O3
Thu Aug 13 15:02:07 2026 ===  0.021667 === output
> gcc: error: unrecognized command-line option ‘-Qunused-arguments’
Thu Aug 13 15:02:07 2026 ===  0.000355 === cpucycles/cpucycles.c compiler exited 1
Thu Aug 13 15:02:07 2026 ===  0.000114 === cpucycles/sparc32cpuinfo compiling gcc -fPIC -Wall -fomit-frame-pointer -fwrapv -O3
Thu Aug 13 15:02:07 2026 ===  0.038460 === output
> cpucycles.c: In function ‘djbsort_cpucycles’:
> cpucycles.c:10:3: error: unknown register name ‘o4’ in ‘asm’
>    10 |   asm volatile(".word 2202075136; .word 2570088480; srl %%g1,0,%L0; mov %%o4,%H0"
>       |   ^~~
> cpucycles.c:10:3: error: unknown register name ‘g1’ in ‘asm’
Thu Aug 13 15:02:07 2026 ===  0.000382 === cpucycles/cpucycles.c compiler exited 1
Thu Aug 13 15:02:07 2026 ===  0.000100 === cpucycles/sparc32cpuinfo compiling gcc -fPIC -Wall -fomit-frame-pointer -fwrapv -march=core-avx2 -O3
Thu Aug 13 15:02:07 2026 ===  0.057883 === output
> cpucycles.c: In function ‘djbsort_cpucycles’:
> cpucycles.c:10:3: error: unknown register name ‘o4’ in ‘asm’
>    10 |   asm volatile(".word 2202075136; .word 2570088480; srl %%g1,0,%L0; mov %%o4,%H0"
>       |   ^~~
> cpucycles.c:10:3: error: unknown register name ‘g1’ in ‘asm’
Thu Aug 13 15:02:07 2026 ===  0.000373 === cpucycles/cpucycles.c compiler exited 1
Thu Aug 13 15:02:07 2026 ===  0.000075 === cpucycles/sparc32cpuinfo compiling clang -fPIC -Wall -fomit-frame-pointer -fwrapv -Qunused-arguments -O3
Thu Aug 13 15:02:07 2026 ===  0.016342 === output
> gcc: error: unrecognized command-line option ‘-Qunused-arguments’
Thu Aug 13 15:02:07 2026 ===  0.000331 === cpucycles/cpucycles.c compiler exited 1
Thu Aug 13 15:02:07 2026 ===  0.000077 === cpucycles/sparc32cpuinfo compiling clang -fPIC -Wall -fomit-frame-pointer -fwrapv -Qunused-arguments -mavx2 -O3
Thu Aug 13 15:02:07 2026 ===  0.016475 === output
> gcc: error: unrecognized command-line option ‘-Qunused-arguments’
Thu Aug 13 15:02:07 2026 ===  0.000344 === cpucycles/cpucycles.c compiler exited 1
Thu Aug 13 15:02:07 2026 ===  0.000115 === cpucycles/sparccpuinfo compiling gcc -fPIC -Wall -fomit-frame-pointer -fwrapv -O3
Thu Aug 13 15:02:07 2026 ===  0.074050 === output
> cpucycles.c: In function ‘djbsort_cpucycles’:
> cpucycles.c:12:1: warning: unsupported size for integer register
>    12 | }
>       | ^
> cpucycles.c: Assembler messages:
> cpucycles.c:10: Error: no such instruction: `rd %tick,%eax'
Thu Aug 13 15:02:07 2026 ===  0.002433 === cpucycles/cpucycles.c compiler exited 1
Thu Aug 13 15:02:07 2026 ===  0.000079 === cpucycles/sparccpuinfo compiling gcc -fPIC -Wall -fomit-frame-pointer -fwrapv -march=core-avx2 -O3
Thu Aug 13 15:02:07 2026 ===  0.089691 === output
> cpucycles.c: In function ‘djbsort_cpucycles’:
> cpucycles.c:12:1: warning: unsupported size for integer register
>    12 | }
>       | ^
> cpucycles.c: Assembler messages:
> cpucycles.c:10: Error: no such instruction: `rd %tick,%eax'
Thu Aug 13 15:02:07 2026 ===  0.000389 === cpucycles/cpucycles.c compiler exited 1
Thu Aug 13 15:02:07 2026 ===  0.000093 === cpucycles/sparccpuinfo compiling clang -fPIC -Wall -fomit-frame-pointer -fwrapv -Qunused-arguments -O3
Thu Aug 13 15:02:07 2026 ===  0.020170 === output
> gcc: error: unrecognized command-line option ‘-Qunused-arguments’
Thu Aug 13 15:02:07 2026 ===  0.000360 === cpucycles/cpucycles.c compiler exited 1
Thu Aug 13 15:02:07 2026 ===  0.000090 === cpucycles/sparccpuinfo compiling clang -fPIC -Wall -fomit-frame-pointer -fwrapv -Qunused-arguments -mavx2 -O3
Thu Aug 13 15:02:07 2026 ===  0.025307 === output
> gcc: error: unrecognized command-line option ‘-Qunused-arguments’
Thu Aug 13 15:02:07 2026 ===  0.000368 === cpucycles/cpucycles.c compiler exited 1
Thu Aug 13 15:02:07 2026 ===  0.000119 === cpucycles/vct compiling gcc -fPIC -Wall -fomit-frame-pointer -fwrapv -O3
Thu Aug 13 15:02:07 2026 ===  0.113898 === output
> cpucycles.c: In function ‘guesstbcycles’:
> cpucycles.c:52:1: warning: unsupported size for integer register
>    52 | }
>       | ^
> cpucycles.c:52:1: warning: unsupported size for integer register
> cpucycles.c: In function ‘djbsort_cpucycles’:
> cpucycles.c:82:1: warning: unsupported size for integer register
>    82 | }
>       | ^
> cpucycles.c: Assembler messages:
> cpucycles.c:30: Error: no such instruction: `mrs %eax,CNTVCT_EL0'
> cpucycles.c:30: Error: no such instruction: `mrs %esi,CNTVCT_EL0'
> cpucycles.c:30: Error: no such instruction: `mrs %eax,CNTVCT_EL0'
Thu Aug 13 15:02:07 2026 ===  0.000397 === cpucycles/cpucycles.c compiler exited 1
Thu Aug 13 15:02:07 2026 ===  0.000092 === cpucycles/vct compiling gcc -fPIC -Wall -fomit-frame-pointer -fwrapv -march=core-avx2 -O3
Thu Aug 13 15:02:07 2026 ===  0.124947 === output
> cpucycles.c: In function ‘guesstbcycles’:
> cpucycles.c:52:1: warning: unsupported size for integer register
>    52 | }
>       | ^
> cpucycles.c:52:1: warning: unsupported size for integer register
> cpucycles.c: In function ‘djbsort_cpucycles’:
> cpucycles.c:82:1: warning: unsupported size for integer register
>    82 | }
>       | ^
> cpucycles.c: Assembler messages:
> cpucycles.c:30: Error: no such instruction: `mrs %eax,CNTVCT_EL0'
> cpucycles.c:30: Error: no such instruction: `mrs %esi,CNTVCT_EL0'
> cpucycles.c:30: Error: no such instruction: `mrs %eax,CNTVCT_EL0'
Thu Aug 13 15:02:07 2026 ===  0.000408 === cpucycles/cpucycles.c compiler exited 1
Thu Aug 13 15:02:07 2026 ===  0.000095 === cpucycles/vct compiling clang -fPIC -Wall -fomit-frame-pointer -fwrapv -Qunused-arguments -O3
Thu Aug 13 15:02:07 2026 ===  0.020080 === output
> gcc: error: unrecognized command-line option ‘-Qunused-arguments’
Thu Aug 13 15:02:07 2026 ===  0.000371 === cpucycles/cpucycles.c compiler exited 1
Thu Aug 13 15:02:07 2026 ===  0.000086 === cpucycles/vct compiling clang -fPIC -Wall -fomit-frame-pointer -fwrapv -Qunused-arguments -mavx2 -O3
Thu Aug 13 15:02:07 2026 ===  0.020207 === output
> gcc: error: unrecognized command-line option ‘-Qunused-arguments’
Thu Aug 13 15:02:07 2026 ===  0.000308 === cpucycles/cpucycles.c compiler exited 1
Thu Aug 13 15:02:07 2026 ===  0.000102 === cpucycles/x86cpuinfo compiling gcc -fPIC -Wall -fomit-frame-pointer -fwrapv -O3
Thu Aug 13 15:02:07 2026 ===  0.213558 === cpucycles/x86cpuinfo compiling gcc -fPIC -Wall -fomit-frame-pointer -fwrapv -march=core-avx2 -O3
Thu Aug 13 15:02:08 2026 ===  0.249693 === cpucycles/x86cpuinfo compiling clang -fPIC -Wall -fomit-frame-pointer -fwrapv -Qunused-arguments -O3
Thu Aug 13 15:02:08 2026 ===  0.023029 === output
> gcc: error: unrecognized command-line option ‘-Qunused-arguments’
Thu Aug 13 15:02:08 2026 ===  0.000374 === cpucycles/cpucycles.c compiler exited 1
Thu Aug 13 15:02:08 2026 ===  0.000082 === cpucycles/x86cpuinfo compiling clang -fPIC -Wall -fomit-frame-pointer -fwrapv -Qunused-arguments -mavx2 -O3
Thu Aug 13 15:02:08 2026 ===  0.017608 === output
> gcc: error: unrecognized command-line option ‘-Qunused-arguments’
Thu Aug 13 15:02:08 2026 ===  0.000374 === cpucycles/cpucycles.c compiler exited 1
Thu Aug 13 15:02:08 2026 ===  0.000108 === cpucycles/x86cpuspeed compiling gcc -fPIC -Wall -fomit-frame-pointer -fwrapv -O3
Thu Aug 13 15:02:08 2026 ===  0.033836 === output
> cpucycles.c: In function ‘djbsort_cpucycles_persecond’:
> cpucycles.c:20:12: error: ‘HW_CPUSPEED’ undeclared (first use in this function)
>    20 |   oid[1] = HW_CPUSPEED;
>       |            ^~~~~~~~~~~
> cpucycles.c:20:12: note: each undeclared identifier is reported only once for each function it appears in
Thu Aug 13 15:02:08 2026 ===  0.000353 === cpucycles/cpucycles.c compiler exited 1
Thu Aug 13 15:02:08 2026 ===  0.000072 === cpucycles/x86cpuspeed compiling gcc -fPIC -Wall -fomit-frame-pointer -fwrapv -march=core-avx2 -O3
Thu Aug 13 15:02:08 2026 ===  0.037472 === output
> cpucycles.c: In function ‘djbsort_cpucycles_persecond’:
> cpucycles.c:20:12: error: ‘HW_CPUSPEED’ undeclared (first use in this function)
>    20 |   oid[1] = HW_CPUSPEED;
>       |            ^~~~~~~~~~~
> cpucycles.c:20:12: note: each undeclared identifier is reported only once for each function it appears in
Thu Aug 13 15:02:08 2026 ===  0.000361 === cpucycles/cpucycles.c compiler exited 1
Thu Aug 13 15:02:08 2026 ===  0.000075 === cpucycles/x86cpuspeed compiling clang -fPIC -Wall -fomit-frame-pointer -fwrapv -Qunused-arguments -O3
Thu Aug 13 15:02:08 2026 ===  0.021475 === output
> gcc: error: unrecognized command-line option ‘-Qunused-arguments’
Thu Aug 13 15:02:08 2026 ===  0.000375 === cpucycles/cpucycles.c compiler exited 1
Thu Aug 13 15:02:08 2026 ===  0.000082 === cpucycles/x86cpuspeed compiling clang -fPIC -Wall -fomit-frame-pointer -fwrapv -Qunused-arguments -mavx2 -O3
Thu Aug 13 15:02:08 2026 ===  0.021168 === output
> gcc: error: unrecognized command-line option ‘-Qunused-arguments’
Thu Aug 13 15:02:08 2026 ===  0.000365 === cpucycles/cpucycles.c compiler exited 1
Thu Aug 13 15:02:08 2026 ===  0.000112 === cpucycles/x86estimate compiling gcc -fPIC -Wall -fomit-frame-pointer -fwrapv -O3
Thu Aug 13 15:02:08 2026 ===  0.224908 === cpucycles/x86estimate compiling gcc -fPIC -Wall -fomit-frame-pointer -fwrapv -march=core-avx2 -O3
Thu Aug 13 15:02:08 2026 ===  0.244731 === cpucycles/x86estimate compiling clang -fPIC -Wall -fomit-frame-pointer -fwrapv -Qunused-arguments -O3
Thu Aug 13 15:02:08 2026 ===  0.021114 === output
> gcc: error: unrecognized command-line option ‘-Qunused-arguments’
Thu Aug 13 15:02:08 2026 ===  0.000387 === cpucycles/cpucycles.c compiler exited 1
Thu Aug 13 15:02:08 2026 ===  0.000097 === cpucycles/x86estimate compiling clang -fPIC -Wall -fomit-frame-pointer -fwrapv -Qunused-arguments -mavx2 -O3
Thu Aug 13 15:02:08 2026 ===  0.021548 === output
> gcc: error: unrecognized command-line option ‘-Qunused-arguments’
Thu Aug 13 15:02:08 2026 ===  0.000375 === cpucycles/cpucycles.c compiler exited 1
Thu Aug 13 15:02:08 2026 ===  0.000119 === cpucycles/x86tscfreq compiling gcc -fPIC -Wall -fomit-frame-pointer -fwrapv -O3
Thu Aug 13 15:02:08 2026 ===  0.187049 === cpucycles/x86tscfreq compiling gcc -fPIC -Wall -fomit-frame-pointer -fwrapv -march=core-avx2 -O3
Thu Aug 13 15:02:09 2026 ===  0.192045 === cpucycles/x86tscfreq compiling clang -fPIC -Wall -fomit-frame-pointer -fwrapv -Qunused-arguments -O3
Thu Aug 13 15:02:09 2026 ===  0.018350 === output
> gcc: error: unrecognized command-line option ‘-Qunused-arguments’
Thu Aug 13 15:02:09 2026 ===  0.000396 === cpucycles/cpucycles.c compiler exited 1
Thu Aug 13 15:02:09 2026 ===  0.000096 === cpucycles/x86tscfreq compiling clang -fPIC -Wall -fomit-frame-pointer -fwrapv -Qunused-arguments -mavx2 -O3
Thu Aug 13 15:02:09 2026 ===  0.014251 === output
> gcc: error: unrecognized command-line option ‘-Qunused-arguments’
Thu Aug 13 15:02:09 2026 ===  0.000370 === cpucycles/cpucycles.c compiler exited 1
Thu Aug 13 15:02:09 2026 ===  0.001861 === int32/avx2 compiling gcc -fPIC -Wall -fomit-frame-pointer -fwrapv -O3
Thu Aug 13 15:02:09 2026 ===  0.000516 === int32/avx2/sort.c compiling
Thu Aug 13 15:02:09 2026 ===  0.388967 === output
> sort.c: In function ‘djbsort_int32’:
> sort.c:939:38: warning: AVX vector return without AVX enabled changes the ABI [-Wpsabi]
>   939 |     for (i = q>>3;i < q>>2;++i) y[i] = _mm256_set1_epi32(0x7fffffff);
>       |                                 ~~~~~^~~~~~~~~~~~~~~~~~~~~~~~~~~~~~~
> In file included from /usr/include/gcc-10/immintrin.h:51,
>                  from sort.c:4:
> sort.c: In function ‘minmax_vector’:
> /usr/include/gcc-10/avxintrin.h:926:1: error: inlining failed in call to ‘always_inline’ ‘_mm256_storeu_si256’: target specific option mismatch
>   926 | _mm256_storeu_si256 (__m256i_u *__P, __m256i __A)
>       | ^~~~~~~~~~~~~~~~~~~
> sort.c:9:28: note: called from here
>     9 | #define int32x8_store(z,i) _mm256_storeu_si256((__m256i *) (z),(i))
>       |                            ^~~~~~~~~~~~~~~~~~~~~~~~~~~~~~~~~~~~~~~~
> sort.c:37:5: note: in expansion of macro ‘int32x8_store’
>    37 |     int32x8_store(y + n - 8,y0);
>       |     ^~~~~~~~~~~~~
> In file included from /usr/include/gcc-10/immintrin.h:51,
>                  from sort.c:4:
> /usr/include/gcc-10/avxintrin.h:926:1: error: inlining failed in call to ‘always_inline’ ‘_mm256_storeu_si256’: target specific option mismatch
>   926 | _mm256_storeu_si256 (__m256i_u *__P, __m256i __A)
>       | ^~~~~~~~~~~~~~~~~~~
> sort.c:9:28: note: called from here
>     9 | #define int32x8_store(z,i) _mm256_storeu_si256((__m256i *) (z),(i))
>       |                            ^~~~~~~~~~~~~~~~~~~~~~~~~~~~~~~~~~~~~~~~
> sort.c:36:5: note: in expansion of macro ‘int32x8_store’
>    36 |     int32x8_store(x + n - 8,x0);
>       |     ^~~~~~~~~~~~~
> In file included from /usr/include/gcc-10/immintrin.h:53,
>                  from sort.c:4:
> /usr/include/gcc-10/avx2intrin.h:363:1: error: inlining failed in call to ‘always_inline’ ‘_mm256_max_epi32’: target specific option mismatch
>   363 | _mm256_max_epi32 (__m256i __A, __m256i __B)
>       | ^~~~~~~~~~~~~~~~
> sort.c:11:21: note: called from here
>    11 | #define int32x8_max _mm256_max_epi32
>       |                     ^
> sort.c:16:7: note: in expansion of macro ‘int32x8_max’
>    16 |   b = int32x8_max(a,b); \
>       |       ^~~~~~~~~~~
> sort.c:35:5: note: in expansion of macro ‘int32x8_MINMAX’
>    35 |     int32x8_MINMAX(x0,y0);
>       |     ^~~~~~~~~~~~~~
> In file included from /usr/include/gcc-10/immintrin.h:53,
>                  from sort.c:4:
> /usr/include/gcc-10/avx2intrin.h:405:1: error: inlining failed in call to ‘always_inline’ ‘_mm256_min_epi32’: target specific option mismatch
>   405 | _mm256_min_epi32 (__m256i __A, __m256i __B)
>       | ^~~~~~~~~~~~~~~~
> sort.c:10:21: note: called from here
>    10 | #define int32x8_min _mm256_min_epi32
>       |                     ^
> sort.c:15:15: note: in expansion of macro ‘int32x8_min’
>    15 |   int32x8 c = int32x8_min(a,b); \
>       |               ^~~~~~~~~~~
> sort.c:35:5: note: in expansion of macro ‘int32x8_MINMAX’
>    35 |     int32x8_MINMAX(x0,y0);
>       |     ^~~~~~~~~~~~~~
> In file included from /usr/include/gcc-10/immintrin.h:51,
>                  from sort.c:4:
> /usr/include/gcc-10/avxintrin.h:920:1: error: inlining failed in call to ‘always_inline’ ‘_mm256_loadu_si256’: target specific option mismatch
>   920 | _mm256_loadu_si256 (__m256i_u const *__P)
>       | ^~~~~~~~~~~~~~~~~~
> sort.c:8:25: note: called from here
>     8 | #define int32x8_load(z) _mm256_loadu_si256((__m256i *) (z))
>       |                         ^~~~~~~~~~~~~~~~~~~~~~~~~~~~~~~~~~~
> sort.c:34:18: note: in expansion of macro ‘int32x8_load’
>    34 |     int32x8 y0 = int32x8_load(y + n - 8);
>       |                  ^~~~~~~~~~~~
> In file included from /usr/include/gcc-10/immintrin.h:51,
>                  from sort.c:4:
> /usr/include/gcc-10/avxintrin.h:920:1: error: inlining failed in call to ‘always_inline’ ‘_mm256_loadu_si256’: target specific option mismatch
>   920 | _mm256_loadu_si256 (__m256i_u const *__P)
>       | ^~~~~~~~~~~~~~~~~~
> sort.c:8:25: note: called from here
>     8 | #define int32x8_load(z) _mm256_loadu_si256((__m256i *) (z))
>       |                         ^~~~~~~~~~~~~~~~~~~~~~~~~~~~~~~~~~~
> sort.c:33:18: note: in expansion of macro ‘int32x8_load’
>    33 |     int32x8 x0 = int32x8_load(x + n - 8);
>       |                  ^~~~~~~~~~~~
> In file included from /usr/include/gcc-10/immintrin.h:51,
>                  from sort.c:4:
> /usr/include/gcc-10/avxintrin.h:926:1: error: inlining failed in call to ‘always_inline’ ‘_mm256_storeu_si256’: target specific option mismatch
>   926 | _mm256_storeu_si256 (__m256i_u *__P, __m256i __A)
>       | ^~~~~~~~~~~~~~~~~~~
> sort.c:9:28: note: called from here
>     9 | #define int32x8_store(z,i) _mm256_storeu_si256((__m256i *) (z),(i))
>       |                            ^~~~~~~~~~~~~~~~~~~~~~~~~~~~~~~~~~~~~~~~
> sort.c:45:5: note: in expansion of macro ‘int32x8_store’
>    45 |     int32x8_store(y,y0);
>       |     ^~~~~~~~~~~~~
> In file included from /usr/include/gcc-10/immintrin.h:51,
>                  from sort.c:4:
> /usr/include/gcc-10/avxintrin.h:926:1: error: inlining failed in call to ‘always_inline’ ‘_mm256_storeu_si256’: target specific option mismatch
>   926 | _mm256_storeu_si256 (__m256i_u *__P, __m256i __A)
>       | ^~~~~~~~~~~~~~~~~~~
> sort.c:9:28: note: called from here
>     9 | #define int32x8_store(z,i) _mm256_storeu_si256((__m256i *) (z),(i))
>       |                            ^~~~~~~~~~~~~~~~~~~~~~~~~~~~~~~~~~~~~~~~
> sort.c:44:5: note: in expansion of macro ‘int32x8_store’
>    44 |     int32x8_store(x,x0);
>       |     ^~~~~~~~~~~~~
> In file included from /usr/include/gcc-10/immintrin.h:53,
>                  from sort.c:4:
> /usr/include/gcc-10/avx2intrin.h:363:1: error: inlining failed in call to ‘always_inline’ ‘_mm256_max_epi32’: target specific option mismatch
>   363 | _mm256_max_epi32 (__m256i __A, __m256i __B)
>       | ^~~~~~~~~~~~~~~~
> sort.c:11:21: note: called from here
>    11 | #define int32x8_max _mm256_max_epi32
>       |                     ^
> sort.c:16:7: note: in expansion of macro ‘int32x8_max’
>    16 |   b = int32x8_max(a,b); \
>       |       ^~~~~~~~~~~
> sort.c:43:5: note: in expansion of macro ‘int32x8_MINMAX’
>    43 |     int32x8_MINMAX(x0,y0);
>       |     ^~~~~~~~~~~~~~
> In file included from /usr/include/gcc-10/immintrin.h:53,
>                  from sort.c:4:
> /usr/include/gcc-10/avx2intrin.h:405:1: error: inlining failed in call to ‘always_inline’ ‘_mm256_min_epi32’: target specific option mismatch
>   405 | _mm256_min_epi32 (__m256i __A, __m256i __B)
>       | ^~~~~~~~~~~~~~~~
> sort.c:10:21: note: called from here
>    10 | #define int32x8_min _mm256_min_epi32
>       |                     ^
> sort.c:15:15: note: in expansion of macro ‘int32x8_min’
>    15 |   int32x8 c = int32x8_min(a,b); \
>       |               ^~~~~~~~~~~
> sort.c:43:5: note: in expansion of macro ‘int32x8_MINMAX’
>    43 |     int32x8_MINMAX(x0,y0);
>       |     ^~~~~~~~~~~~~~
> In file included from /usr/include/gcc-10/immintrin.h:51,
>                  from sort.c:4:
> /usr/include/gcc-10/avxintrin.h:920:1: error: inlining failed in call to ‘always_inline’ ‘_mm256_loadu_si256’: target specific option mismatch
>   920 | _mm256_loadu_si256 (__m256i_u const *__P)
>       | ^~~~~~~~~~~~~~~~~~
> sort.c:8:25: note: called from here
>     8 | #define int32x8_load(z) _mm256_loadu_si256((__m256i *) (z))
>       |                         ^~~~~~~~~~~~~~~~~~~~~~~~~~~~~~~~~~~
> sort.c:42:18: note: in expansion of macro ‘int32x8_load’
>    42 |     int32x8 y0 = int32x8_load(y);
>       |                  ^~~~~~~~~~~~
> In file included from /usr/include/gcc-10/immintrin.h:51,
>                  from sort.c:4:
> /usr/include/gcc-10/avxintrin.h:920:1: error: inlining failed in call to ‘always_inline’ ‘_mm256_loadu_si256’: target specific option mismatch
>   920 | _mm256_loadu_si256 (__m256i_u const *__P)
>       | ^~~~~~~~~~~~~~~~~~
> sort.c:8:25: note: called from here
>     8 | #define int32x8_load(z) _mm256_loadu_si256((__m256i *) (z))
>       |                         ^~~~~~~~~~~~~~~~~~~~~~~~~~~~~~~~~~~
> sort.c:41:18: note: in expansion of macro ‘int32x8_load’
>    41 |     int32x8 x0 = int32x8_load(x);
>       |                  ^~~~~~~~~~~~
Thu Aug 13 15:02:09 2026 ===  0.000510 === int32/avx2/sort.c compiler exited 1
Thu Aug 13 15:02:09 2026 ===  0.000093 === int32/avx2/compiler.c compiling
Thu Aug 13 15:02:09 2026 ===  0.023780 === int32/avx2/version.c compiling
Thu Aug 13 15:02:09 2026 ===  0.023544 === int32/avx2/implementation.c compiling
Thu Aug 13 15:02:09 2026 ===  0.028710 === int32/avx2/cycles.c compiling
Thu Aug 13 15:02:09 2026 ===  0.086576 === int32/avx2/works.c compiling
Thu Aug 13 15:02:09 2026 ===  0.203693 === int32/avx2 compiling gcc -fPIC -Wall -fomit-frame-pointer -fwrapv -march=core-avx2 -O3
Thu Aug 13 15:02:09 2026 ===  0.000419 === int32/avx2/sort.c compiling
Thu Aug 13 15:02:10 2026 ===  0.744926 === int32/avx2/compiler.c compiling
Thu Aug 13 15:02:10 2026 ===  0.025588 === int32/avx2/version.c compiling
Thu Aug 13 15:02:10 2026 ===  0.025279 === int32/avx2/implementation.c compiling
Thu Aug 13 15:02:10 2026 ===  0.024663 === int32/avx2/cycles.c compiling
Thu Aug 13 15:02:10 2026 ===  0.109240 === int32/avx2/works.c compiling
Thu Aug 13 15:02:11 2026 ===  0.360558 === int32/avx2 compiled gcc -fPIC -Wall -fomit-frame-pointer -fwrapv -march=core-avx2 -O3
Thu Aug 13 15:02:11 2026 ===  0.014431 === int32/avx2 compiling clang -fPIC -Wall -fomit-frame-pointer -fwrapv -Qunused-arguments -O3
Thu Aug 13 15:02:11 2026 ===  0.000234 === int32/avx2/sort.c compiling
Thu Aug 13 15:02:11 2026 ===  0.014159 === output
> gcc: error: unrecognized command-line option ‘-Qunused-arguments’
Thu Aug 13 15:02:11 2026 ===  0.000367 === int32/avx2/sort.c compiler exited 1
Thu Aug 13 15:02:11 2026 ===  0.000090 === int32/avx2/compiler.c compiling
Thu Aug 13 15:02:11 2026 ===  0.013534 === output
> gcc: error: unrecognized command-line option ‘-Qunused-arguments’
Thu Aug 13 15:02:11 2026 ===  0.000308 === int32/avx2/compiler.c compiler exited 1
Thu Aug 13 15:02:11 2026 ===  0.000078 === int32/avx2/version.c compiling
Thu Aug 13 15:02:11 2026 ===  0.015084 === output
> gcc: error: unrecognized command-line option ‘-Qunused-arguments’
Thu Aug 13 15:02:11 2026 ===  0.000286 === int32/avx2/version.c compiler exited 1
Thu Aug 13 15:02:11 2026 ===  0.000068 === int32/avx2/implementation.c compiling
Thu Aug 13 15:02:11 2026 ===  0.013556 === output
> gcc: error: unrecognized command-line option ‘-Qunused-arguments’
Thu Aug 13 15:02:11 2026 ===  0.000272 === int32/avx2/implementation.c compiler exited 1
Thu Aug 13 15:02:11 2026 ===  0.000076 === int32/avx2/cycles.c compiling
Thu Aug 13 15:02:11 2026 ===  0.020384 === output
> gcc: error: unrecognized command-line option ‘-Qunused-arguments’
Thu Aug 13 15:02:11 2026 ===  0.000344 === int32/avx2/cycles.c compiler exited 1
Thu Aug 13 15:02:11 2026 ===  0.000080 === int32/avx2/works.c compiling
Thu Aug 13 15:02:11 2026 ===  0.020091 === output
> gcc: error: unrecognized command-line option ‘-Qunused-arguments’
Thu Aug 13 15:02:11 2026 ===  0.000375 === int32/avx2/works.c compiler exited 1
Thu Aug 13 15:02:11 2026 ===  0.000083 === int32/avx2 compiling clang -fPIC -Wall -fomit-frame-pointer -fwrapv -Qunused-arguments -mavx2 -O3
Thu Aug 13 15:02:11 2026 ===  0.000188 === int32/avx2/sort.c compiling
Thu Aug 13 15:02:11 2026 ===  0.019905 === output
> gcc: error: unrecognized command-line option ‘-Qunused-arguments’
Thu Aug 13 15:02:11 2026 ===  0.000490 === int32/avx2/sort.c compiler exited 1
Thu Aug 13 15:02:11 2026 ===  0.000087 === int32/avx2/compiler.c compiling
Thu Aug 13 15:02:11 2026 ===  0.019326 === output
> gcc: error: unrecognized command-line option ‘-Qunused-arguments’
Thu Aug 13 15:02:11 2026 ===  0.000354 === int32/avx2/compiler.c compiler exited 1
Thu Aug 13 15:02:11 2026 ===  0.000078 === int32/avx2/version.c compiling
Thu Aug 13 15:02:11 2026 ===  0.019947 === output
> gcc: error: unrecognized command-line option ‘-Qunused-arguments’
Thu Aug 13 15:02:11 2026 ===  0.000304 === int32/avx2/version.c compiler exited 1
Thu Aug 13 15:02:11 2026 ===  0.000069 === int32/avx2/implementation.c compiling
Thu Aug 13 15:02:11 2026 ===  0.020874 === output
> gcc: error: unrecognized command-line option ‘-Qunused-arguments’
Thu Aug 13 15:02:11 2026 ===  0.000409 === int32/avx2/implementation.c compiler exited 1
Thu Aug 13 15:02:11 2026 ===  0.000106 === int32/avx2/cycles.c compiling
Thu Aug 13 15:02:11 2026 ===  0.019804 === output
> gcc: error: unrecognized command-line option ‘-Qunused-arguments’
Thu Aug 13 15:02:11 2026 ===  0.000401 === int32/avx2/cycles.c compiler exited 1
Thu Aug 13 15:02:11 2026 ===  0.000094 === int32/avx2/works.c compiling
Thu Aug 13 15:02:11 2026 ===  0.020586 === output
> gcc: error: unrecognized command-line option ‘-Qunused-arguments’
Thu Aug 13 15:02:11 2026 ===  0.000393 === int32/avx2/works.c compiler exited 1
Thu Aug 13 15:02:11 2026 ===  0.001837 === int32/portable3 compiling gcc -fPIC -Wall -fomit-frame-pointer -fwrapv -O3
Thu Aug 13 15:02:11 2026 ===  0.000146 === int32/portable3/sort.c compiling
Thu Aug 13 15:02:11 2026 ===  0.079906 === int32/portable3/compiler.c compiling
Thu Aug 13 15:02:11 2026 ===  0.030659 === int32/portable3/version.c compiling
Thu Aug 13 15:02:11 2026 ===  0.025960 === int32/portable3/implementation.c compiling
Thu Aug 13 15:02:11 2026 ===  0.026749 === int32/portable3/cycles.c compiling
Thu Aug 13 15:02:11 2026 ===  0.097846 === int32/portable3/works.c compiling
Thu Aug 13 15:02:12 2026 ===  0.301353 === int32/portable3 compiled gcc -fPIC -Wall -fomit-frame-pointer -fwrapv -O3
Thu Aug 13 15:02:12 2026 ===  0.017152 === int32/portable3 compiling gcc -fPIC -Wall -fomit-frame-pointer -fwrapv -march=core-avx2 -O3
Thu Aug 13 15:02:12 2026 ===  0.000222 === int32/portable3/sort.c compiling
Thu Aug 13 15:02:12 2026 ===  0.096128 === int32/portable3/compiler.c compiling
Thu Aug 13 15:02:12 2026 ===  0.026825 === int32/portable3/version.c compiling
Thu Aug 13 15:02:12 2026 ===  0.031193 === int32/portable3/implementation.c compiling
Thu Aug 13 15:02:12 2026 ===  0.025584 === int32/portable3/cycles.c compiling
Thu Aug 13 15:02:12 2026 ===  0.114252 === int32/portable3/works.c compiling
Thu Aug 13 15:02:12 2026 ===  0.333401 === int32/portable3 compiled gcc -fPIC -Wall -fomit-frame-pointer -fwrapv -march=core-avx2 -O3
Thu Aug 13 15:02:12 2026 ===  0.018689 === int32/portable3 compiling clang -fPIC -Wall -fomit-frame-pointer -fwrapv -Qunused-arguments -O3
Thu Aug 13 15:02:12 2026 ===  0.000240 === int32/portable3/sort.c compiling
Thu Aug 13 15:02:12 2026 ===  0.023669 === output
> gcc: error: unrecognized command-line option ‘-Qunused-arguments’
Thu Aug 13 15:02:12 2026 ===  0.000366 === int32/portable3/sort.c compiler exited 1
Thu Aug 13 15:02:12 2026 ===  0.000103 === int32/portable3/compiler.c compiling
Thu Aug 13 15:02:12 2026 ===  0.018929 === output
> gcc: error: unrecognized command-line option ‘-Qunused-arguments’
Thu Aug 13 15:02:12 2026 ===  0.001356 === int32/portable3/compiler.c compiler exited 1
Thu Aug 13 15:02:12 2026 ===  0.000102 === int32/portable3/version.c compiling
Thu Aug 13 15:02:12 2026 ===  0.018640 === output
> gcc: error: unrecognized command-line option ‘-Qunused-arguments’
Thu Aug 13 15:02:12 2026 ===  0.000383 === int32/portable3/version.c compiler exited 1
Thu Aug 13 15:02:12 2026 ===  0.000104 === int32/portable3/implementation.c compiling
Thu Aug 13 15:02:12 2026 ===  0.020495 === output
> gcc: error: unrecognized command-line option ‘-Qunused-arguments’
Thu Aug 13 15:02:12 2026 ===  0.000380 === int32/portable3/implementation.c compiler exited 1
Thu Aug 13 15:02:12 2026 ===  0.000095 === int32/portable3/cycles.c compiling
Thu Aug 13 15:02:12 2026 ===  0.020640 === output
> gcc: error: unrecognized command-line option ‘-Qunused-arguments’
Thu Aug 13 15:02:12 2026 ===  0.000390 === int32/portable3/cycles.c compiler exited 1
Thu Aug 13 15:02:12 2026 ===  0.000122 === int32/portable3/works.c compiling
Thu Aug 13 15:02:12 2026 ===  0.019805 === output
> gcc: error: unrecognized command-line option ‘-Qunused-arguments’
Thu Aug 13 15:02:12 2026 ===  0.000402 === int32/portable3/works.c compiler exited 1
Thu Aug 13 15:02:12 2026 ===  0.000100 === int32/portable3 compiling clang -fPIC -Wall -fomit-frame-pointer -fwrapv -Qunused-arguments -mavx2 -O3
Thu Aug 13 15:02:12 2026 ===  0.000224 === int32/portable3/sort.c compiling
Thu Aug 13 15:02:12 2026 ===  0.020607 === output
> gcc: error: unrecognized command-line option ‘-Qunused-arguments’
Thu Aug 13 15:02:12 2026 ===  0.000390 === int32/portable3/sort.c compiler exited 1
Thu Aug 13 15:02:12 2026 ===  0.000130 === int32/portable3/compiler.c compiling
Thu Aug 13 15:02:12 2026 ===  0.019798 === output
> gcc: error: unrecognized command-line option ‘-Qunused-arguments’
Thu Aug 13 15:02:12 2026 ===  0.000405 === int32/portable3/compiler.c compiler exited 1
Thu Aug 13 15:02:12 2026 ===  0.000092 === int32/portable3/version.c compiling
Thu Aug 13 15:02:12 2026 ===  0.018494 === output
> gcc: error: unrecognized command-line option ‘-Qunused-arguments’
Thu Aug 13 15:02:12 2026 ===  0.000359 === int32/portable3/version.c compiler exited 1
Thu Aug 13 15:02:12 2026 ===  0.000093 === int32/portable3/implementation.c compiling
Thu Aug 13 15:02:12 2026 ===  0.016866 === output
> gcc: error: unrecognized command-line option ‘-Qunused-arguments’
Thu Aug 13 15:02:12 2026 ===  0.000248 === int32/portable3/implementation.c compiler exited 1
Thu Aug 13 15:02:12 2026 ===  0.000063 === int32/portable3/cycles.c compiling
Thu Aug 13 15:02:12 2026 ===  0.019761 === output
> gcc: error: unrecognized command-line option ‘-Qunused-arguments’
Thu Aug 13 15:02:12 2026 ===  0.000302 === int32/portable3/cycles.c compiler exited 1
Thu Aug 13 15:02:12 2026 ===  0.000069 === int32/portable3/works.c compiling
Thu Aug 13 15:02:12 2026 ===  0.019467 === output
> gcc: error: unrecognized command-line option ‘-Qunused-arguments’
Thu Aug 13 15:02:12 2026 ===  0.000283 === int32/portable3/works.c compiler exited 1
Thu Aug 13 15:02:12 2026 ===  0.001295 === int32/portable4 compiling gcc -fPIC -Wall -fomit-frame-pointer -fwrapv -O3
Thu Aug 13 15:02:12 2026 ===  0.000094 === int32/portable4/sort.c compiling
Thu Aug 13 15:02:13 2026 ===  0.100832 === int32/portable4/compiler.c compiling
Thu Aug 13 15:02:13 2026 ===  0.027773 === int32/portable4/version.c compiling
Thu Aug 13 15:02:13 2026 ===  0.028560 === int32/portable4/implementation.c compiling
Thu Aug 13 15:02:13 2026 ===  0.021750 === int32/portable4/cycles.c compiling
Thu Aug 13 15:02:13 2026 ===  0.092351 === int32/portable4/works.c compiling
Thu Aug 13 15:02:13 2026 ===  0.285953 === int32/portable4 compiled gcc -fPIC -Wall -fomit-frame-pointer -fwrapv -O3
Thu Aug 13 15:02:13 2026 ===  0.014781 === int32/portable4 compiling gcc -fPIC -Wall -fomit-frame-pointer -fwrapv -march=core-avx2 -O3
Thu Aug 13 15:02:13 2026 ===  0.000305 === int32/portable4/sort.c compiling
Thu Aug 13 15:02:13 2026 ===  0.177274 === int32/portable4/compiler.c compiling
Thu Aug 13 15:02:13 2026 ===  0.024146 === int32/portable4/version.c compiling
Thu Aug 13 15:02:13 2026 ===  0.025282 === int32/portable4/implementation.c compiling
Thu Aug 13 15:02:13 2026 ===  0.022100 === int32/portable4/cycles.c compiling
Thu Aug 13 15:02:13 2026 ===  0.119086 === int32/portable4/works.c compiling
Thu Aug 13 15:02:14 2026 ===  0.352683 === int32/portable4 compiled gcc -fPIC -Wall -fomit-frame-pointer -fwrapv -march=core-avx2 -O3
Thu Aug 13 15:02:14 2026 ===  0.025667 === int32/portable4 compiling clang -fPIC -Wall -fomit-frame-pointer -fwrapv -Qunused-arguments -O3
Thu Aug 13 15:02:14 2026 ===  0.000256 === int32/portable4/sort.c compiling
Thu Aug 13 15:02:14 2026 ===  0.017755 === output
> gcc: error: unrecognized command-line option ‘-Qunused-arguments’
Thu Aug 13 15:02:14 2026 ===  0.000322 === int32/portable4/sort.c compiler exited 1
Thu Aug 13 15:02:14 2026 ===  0.000083 === int32/portable4/compiler.c compiling
Thu Aug 13 15:02:14 2026 ===  0.022785 === output
> gcc: error: unrecognized command-line option ‘-Qunused-arguments’
Thu Aug 13 15:02:14 2026 ===  0.000365 === int32/portable4/compiler.c compiler exited 1
Thu Aug 13 15:02:14 2026 ===  0.000083 === int32/portable4/version.c compiling
Thu Aug 13 15:02:14 2026 ===  0.019870 === output
> gcc: error: unrecognized command-line option ‘-Qunused-arguments’
Thu Aug 13 15:02:14 2026 ===  0.000365 === int32/portable4/version.c compiler exited 1
Thu Aug 13 15:02:14 2026 ===  0.000083 === int32/portable4/implementation.c compiling
Thu Aug 13 15:02:14 2026 ===  0.014431 === output
> gcc: error: unrecognized command-line option ‘-Qunused-arguments’
Thu Aug 13 15:02:14 2026 ===  0.000333 === int32/portable4/implementation.c compiler exited 1
Thu Aug 13 15:02:14 2026 ===  0.000083 === int32/portable4/cycles.c compiling
Thu Aug 13 15:02:14 2026 ===  0.019200 === output
> gcc: error: unrecognized command-line option ‘-Qunused-arguments’
Thu Aug 13 15:02:14 2026 ===  0.000373 === int32/portable4/cycles.c compiler exited 1
Thu Aug 13 15:02:14 2026 ===  0.000101 === int32/portable4/works.c compiling
Thu Aug 13 15:02:14 2026 ===  0.015411 === output
> gcc: error: unrecognized command-line option ‘-Qunused-arguments’
Thu Aug 13 15:02:14 2026 ===  0.000381 === int32/portable4/works.c compiler exited 1
Thu Aug 13 15:02:14 2026 ===  0.000106 === int32/portable4 compiling clang -fPIC -Wall -fomit-frame-pointer -fwrapv -Qunused-arguments -mavx2 -O3
Thu Aug 13 15:02:14 2026 ===  0.000219 === int32/portable4/sort.c compiling
Thu Aug 13 15:02:14 2026 ===  0.015976 === output
> gcc: error: unrecognized command-line option ‘-Qunused-arguments’
Thu Aug 13 15:02:14 2026 ===  0.000346 === int32/portable4/sort.c compiler exited 1
Thu Aug 13 15:02:14 2026 ===  0.000092 === int32/portable4/compiler.c compiling
Thu Aug 13 15:02:14 2026 ===  0.013352 === output
> gcc: error: unrecognized command-line option ‘-Qunused-arguments’
Thu Aug 13 15:02:14 2026 ===  0.000292 === int32/portable4/compiler.c compiler exited 1
Thu Aug 13 15:02:14 2026 ===  0.000070 === int32/portable4/version.c compiling
Thu Aug 13 15:02:14 2026 ===  0.014796 === output
> gcc: error: unrecognized command-line option ‘-Qunused-arguments’
Thu Aug 13 15:02:14 2026 ===  0.000279 === int32/portable4/version.c compiler exited 1
Thu Aug 13 15:02:14 2026 ===  0.000072 === int32/portable4/implementation.c compiling
Thu Aug 13 15:02:14 2026 ===  0.018634 === output
> gcc: error: unrecognized command-line option ‘-Qunused-arguments’
Thu Aug 13 15:02:14 2026 ===  0.000332 === int32/portable4/implementation.c compiler exited 1
Thu Aug 13 15:02:14 2026 ===  0.000087 === int32/portable4/cycles.c compiling
Thu Aug 13 15:02:14 2026 ===  0.019162 === output
> gcc: error: unrecognized command-line option ‘-Qunused-arguments’
Thu Aug 13 15:02:14 2026 ===  0.000357 === int32/portable4/cycles.c compiler exited 1
Thu Aug 13 15:02:14 2026 ===  0.000075 === int32/portable4/works.c compiling
Thu Aug 13 15:02:14 2026 ===  0.017821 === output
> gcc: error: unrecognized command-line option ‘-Qunused-arguments’
Thu Aug 13 15:02:14 2026 ===  0.000303 === int32/portable4/works.c compiler exited 1
Thu Aug 13 15:02:14 2026 ===  0.001636 === uint32/useint32 compiling gcc -fPIC -Wall -fomit-frame-pointer -fwrapv -O3
Thu Aug 13 15:02:14 2026 ===  0.000127 === uint32/useint32/sort.c compiling
Thu Aug 13 15:02:14 2026 ===  0.037373 === uint32/useint32/compiler.c compiling
Thu Aug 13 15:02:14 2026 ===  0.023610 === uint32/useint32/version.c compiling
Thu Aug 13 15:02:14 2026 ===  0.024596 === uint32/useint32/implementation.c compiling
Thu Aug 13 15:02:14 2026 ===  0.027448 === uint32/useint32/cycles.c compiling
Thu Aug 13 15:02:14 2026 ===  0.086811 === uint32/useint32/works.c compiling
Thu Aug 13 15:02:14 2026 ===  0.080392 === uint32/useint32 compiled gcc -fPIC -Wall -fomit-frame-pointer -fwrapv -O3
Thu Aug 13 15:02:14 2026 ===  0.013627 === uint32/useint32 compiling gcc -fPIC -Wall -fomit-frame-pointer -fwrapv -march=core-avx2 -O3
Thu Aug 13 15:02:14 2026 ===  0.000249 === uint32/useint32/sort.c compiling
Thu Aug 13 15:02:14 2026 ===  0.057350 === uint32/useint32/compiler.c compiling
Thu Aug 13 15:02:14 2026 ===  0.020279 === uint32/useint32/version.c compiling
Thu Aug 13 15:02:14 2026 ===  0.033534 === uint32/useint32/implementation.c compiling
Thu Aug 13 15:02:14 2026 ===  0.025913 === uint32/useint32/cycles.c compiling
Thu Aug 13 15:02:15 2026 ===  0.150693 === uint32/useint32/works.c compiling
Thu Aug 13 15:02:15 2026 ===  0.150831 === uint32/useint32 compiled gcc -fPIC -Wall -fomit-frame-pointer -fwrapv -march=core-avx2 -O3
Thu Aug 13 15:02:15 2026 ===  0.016424 === uint32/useint32 compiling clang -fPIC -Wall -fomit-frame-pointer -fwrapv -Qunused-arguments -O3
Thu Aug 13 15:02:15 2026 ===  0.000225 === uint32/useint32/sort.c compiling
Thu Aug 13 15:02:15 2026 ===  0.017756 === output
> gcc: error: unrecognized command-line option ‘-Qunused-arguments’
Thu Aug 13 15:02:15 2026 ===  0.000421 === uint32/useint32/sort.c compiler exited 1
Thu Aug 13 15:02:15 2026 ===  0.000114 === uint32/useint32/compiler.c compiling
Thu Aug 13 15:02:15 2026 ===  0.015123 === output
> gcc: error: unrecognized command-line option ‘-Qunused-arguments’
Thu Aug 13 15:02:15 2026 ===  0.000329 === uint32/useint32/compiler.c compiler exited 1
Thu Aug 13 15:02:15 2026 ===  0.000084 === uint32/useint32/version.c compiling
Thu Aug 13 15:02:15 2026 ===  0.017589 === output
> gcc: error: unrecognized command-line option ‘-Qunused-arguments’
Thu Aug 13 15:02:15 2026 ===  0.000353 === uint32/useint32/version.c compiler exited 1
Thu Aug 13 15:02:15 2026 ===  0.000097 === uint32/useint32/implementation.c compiling
Thu Aug 13 15:02:15 2026 ===  0.013889 === output
> gcc: error: unrecognized command-line option ‘-Qunused-arguments’
Thu Aug 13 15:02:15 2026 ===  0.000262 === uint32/useint32/implementation.c compiler exited 1
Thu Aug 13 15:02:15 2026 ===  0.000073 === uint32/useint32/cycles.c compiling
Thu Aug 13 15:02:15 2026 ===  0.020085 === output
> gcc: error: unrecognized command-line option ‘-Qunused-arguments’
Thu Aug 13 15:02:15 2026 ===  0.000348 === uint32/useint32/cycles.c compiler exited 1
Thu Aug 13 15:02:15 2026 ===  0.000089 === uint32/useint32/works.c compiling
Thu Aug 13 15:02:15 2026 ===  0.025212 === output
> gcc: error: unrecognized command-line option ‘-Qunused-arguments’
Thu Aug 13 15:02:15 2026 ===  0.000367 === uint32/useint32/works.c compiler exited 1
Thu Aug 13 15:02:15 2026 ===  0.000096 === uint32/useint32 compiling clang -fPIC -Wall -fomit-frame-pointer -fwrapv -Qunused-arguments -mavx2 -O3
Thu Aug 13 15:02:15 2026 ===  0.000215 === uint32/useint32/sort.c compiling
Thu Aug 13 15:02:15 2026 ===  0.014730 === output
> gcc: error: unrecognized command-line option ‘-Qunused-arguments’
Thu Aug 13 15:02:15 2026 ===  0.000395 === uint32/useint32/sort.c compiler exited 1
Thu Aug 13 15:02:15 2026 ===  0.000097 === uint32/useint32/compiler.c compiling
Thu Aug 13 15:02:15 2026 ===  0.020660 === output
> gcc: error: unrecognized command-line option ‘-Qunused-arguments’
Thu Aug 13 15:02:15 2026 ===  0.000373 === uint32/useint32/compiler.c compiler exited 1
Thu Aug 13 15:02:15 2026 ===  0.000090 === uint32/useint32/version.c compiling
Thu Aug 13 15:02:15 2026 ===  0.020119 === output
> gcc: error: unrecognized command-line option ‘-Qunused-arguments’
Thu Aug 13 15:02:15 2026 ===  0.000380 === uint32/useint32/version.c compiler exited 1
Thu Aug 13 15:02:15 2026 ===  0.000097 === uint32/useint32/implementation.c compiling
Thu Aug 13 15:02:15 2026 ===  0.014307 === output
> gcc: error: unrecognized command-line option ‘-Qunused-arguments’
Thu Aug 13 15:02:15 2026 ===  0.000326 === uint32/useint32/implementation.c compiler exited 1
Thu Aug 13 15:02:15 2026 ===  0.000094 === uint32/useint32/cycles.c compiling
Thu Aug 13 15:02:15 2026 ===  0.014467 === output
> gcc: error: unrecognized command-line option ‘-Qunused-arguments’
Thu Aug 13 15:02:15 2026 ===  0.000344 === uint32/useint32/cycles.c compiler exited 1
Thu Aug 13 15:02:15 2026 ===  0.000087 === uint32/useint32/works.c compiling
Thu Aug 13 15:02:15 2026 ===  0.019441 === output
> gcc: error: unrecognized command-line option ‘-Qunused-arguments’
Thu Aug 13 15:02:15 2026 ===  0.000359 === uint32/useint32/works.c compiler exited 1
Thu Aug 13 15:02:15 2026 ===  0.001625 === float32/useint32 compiling gcc -fPIC -Wall -fomit-frame-pointer -fwrapv -O3
Thu Aug 13 15:02:15 2026 ===  0.000135 === float32/useint32/sort.c compiling
Thu Aug 13 15:02:15 2026 ===  0.034406 === float32/useint32/compiler.c compiling
Thu Aug 13 15:02:15 2026 ===  0.023492 === float32/useint32/version.c compiling
Thu Aug 13 15:02:15 2026 ===  0.021765 === float32/useint32/implementation.c compiling
Thu Aug 13 15:02:15 2026 ===  0.021667 === float32/useint32/cycles.c compiling
Thu Aug 13 15:02:15 2026 ===  0.095881 === float32/useint32/works.c compiling
Thu Aug 13 15:02:15 2026 ===  0.093923 === float32/useint32 compiled gcc -fPIC -Wall -fomit-frame-pointer -fwrapv -O3
Thu Aug 13 15:02:15 2026 ===  0.016385 === float32/useint32 compiling gcc -fPIC -Wall -fomit-frame-pointer -fwrapv -march=core-avx2 -O3
Thu Aug 13 15:02:15 2026 ===  0.000240 === float32/useint32/sort.c compiling
Thu Aug 13 15:02:15 2026 ===  0.068990 === float32/useint32/compiler.c compiling
Thu Aug 13 15:02:15 2026 ===  0.027446 === float32/useint32/version.c compiling
Thu Aug 13 15:02:15 2026 ===  0.024813 === float32/useint32/implementation.c compiling
Thu Aug 13 15:02:15 2026 ===  0.024920 === float32/useint32/cycles.c compiling
Thu Aug 13 15:02:16 2026 ===  0.124182 === float32/useint32/works.c compiling
Thu Aug 13 15:02:16 2026 ===  0.099413 === float32/useint32 compiled gcc -fPIC -Wall -fomit-frame-pointer -fwrapv -march=core-avx2 -O3
Thu Aug 13 15:02:16 2026 ===  0.016750 === float32/useint32 compiling clang -fPIC -Wall -fomit-frame-pointer -fwrapv -Qunused-arguments -O3
Thu Aug 13 15:02:16 2026 ===  0.000246 === float32/useint32/sort.c compiling
Thu Aug 13 15:02:16 2026 ===  0.031739 === output
> gcc: error: unrecognized command-line option ‘-Qunused-arguments’
Thu Aug 13 15:02:16 2026 ===  0.000410 === float32/useint32/sort.c compiler exited 1
Thu Aug 13 15:02:16 2026 ===  0.000107 === float32/useint32/compiler.c compiling
Thu Aug 13 15:02:16 2026 ===  0.017303 === output
> gcc: error: unrecognized command-line option ‘-Qunused-arguments’
Thu Aug 13 15:02:16 2026 ===  0.000304 === float32/useint32/compiler.c compiler exited 1
Thu Aug 13 15:02:16 2026 ===  0.000072 === float32/useint32/version.c compiling
Thu Aug 13 15:02:16 2026 ===  0.014640 === output
> gcc: error: unrecognized command-line option ‘-Qunused-arguments’
Thu Aug 13 15:02:16 2026 ===  0.001077 === float32/useint32/version.c compiler exited 1
Thu Aug 13 15:02:16 2026 ===  0.000101 === float32/useint32/implementation.c compiling
Thu Aug 13 15:02:16 2026 ===  0.019545 === output
> gcc: error: unrecognized command-line option ‘-Qunused-arguments’
Thu Aug 13 15:02:16 2026 ===  0.000395 === float32/useint32/implementation.c compiler exited 1
Thu Aug 13 15:02:16 2026 ===  0.000122 === float32/useint32/cycles.c compiling
Thu Aug 13 15:02:16 2026 ===  0.019186 === output
> gcc: error: unrecognized command-line option ‘-Qunused-arguments’
Thu Aug 13 15:02:16 2026 ===  0.000360 === float32/useint32/cycles.c compiler exited 1
Thu Aug 13 15:02:16 2026 ===  0.000102 === float32/useint32/works.c compiling
Thu Aug 13 15:02:16 2026 ===  0.018437 === output
> gcc: error: unrecognized command-line option ‘-Qunused-arguments’
Thu Aug 13 15:02:16 2026 ===  0.000354 === float32/useint32/works.c compiler exited 1
Thu Aug 13 15:02:16 2026 ===  0.000106 === float32/useint32 compiling clang -fPIC -Wall -fomit-frame-pointer -fwrapv -Qunused-arguments -mavx2 -O3
Thu Aug 13 15:02:16 2026 ===  0.000229 === float32/useint32/sort.c compiling
Thu Aug 13 15:02:16 2026 ===  0.022952 === output
> gcc: error: unrecognized command-line option ‘-Qunused-arguments’
Thu Aug 13 15:02:16 2026 ===  0.000427 === float32/useint32/sort.c compiler exited 1
Thu Aug 13 15:02:16 2026 ===  0.000109 === float32/useint32/compiler.c compiling
Thu Aug 13 15:02:16 2026 ===  0.020401 === output
> gcc: error: unrecognized command-line option ‘-Qunused-arguments’
Thu Aug 13 15:02:16 2026 ===  0.000395 === float32/useint32/compiler.c compiler exited 1
Thu Aug 13 15:02:16 2026 ===  0.000116 === float32/useint32/version.c compiling
Thu Aug 13 15:02:16 2026 ===  0.019422 === output
> gcc: error: unrecognized command-line option ‘-Qunused-arguments’
Thu Aug 13 15:02:16 2026 ===  0.000371 === float32/useint32/version.c compiler exited 1
Thu Aug 13 15:02:16 2026 ===  0.000100 === float32/useint32/implementation.c compiling
Thu Aug 13 15:02:16 2026 ===  0.021258 === output
> gcc: error: unrecognized command-line option ‘-Qunused-arguments’
Thu Aug 13 15:02:16 2026 ===  0.000384 === float32/useint32/implementation.c compiler exited 1
Thu Aug 13 15:02:16 2026 ===  0.000106 === float32/useint32/cycles.c compiling
Thu Aug 13 15:02:16 2026 ===  0.019400 === output
> gcc: error: unrecognized command-line option ‘-Qunused-arguments’
Thu Aug 13 15:02:16 2026 ===  0.000378 === float32/useint32/cycles.c compiler exited 1
Thu Aug 13 15:02:16 2026 ===  0.000099 === float32/useint32/works.c compiling
Thu Aug 13 15:02:16 2026 ===  0.017655 === output
> gcc: error: unrecognized command-line option ‘-Qunused-arguments’
Thu Aug 13 15:02:16 2026 ===  0.000334 === float32/useint32/works.c compiler exited 1
Thu Aug 13 15:02:16 2026 ===  0.000109 === command/limits.c compiling gcc -fPIC -Wall -fomit-frame-pointer -fwrapv -O3
Thu Aug 13 15:02:16 2026 ===  0.042931 === command/limits.c compiling gcc -fPIC -Wall -fomit-frame-pointer -fwrapv -march=core-avx2 -O3
Thu Aug 13 15:02:16 2026 ===  0.044123 === command/limits.c compiling clang -fPIC -Wall -fomit-frame-pointer -fwrapv -Qunused-arguments -O3
Thu Aug 13 15:02:16 2026 ===  0.020556 === output
> gcc: error: unrecognized command-line option ‘-Qunused-arguments’
Thu Aug 13 15:02:16 2026 ===  0.000338 === command/limits.c compiler exited 1
Thu Aug 13 15:02:16 2026 ===  0.000105 === command/limits.c compiling clang -fPIC -Wall -fomit-frame-pointer -fwrapv -Qunused-arguments -mavx2 -O3
Thu Aug 13 15:02:16 2026 ===  0.019037 === output
> gcc: error: unrecognized command-line option ‘-Qunused-arguments’
Thu Aug 13 15:02:16 2026 ===  0.000270 === command/limits.c compiler exited 1
Thu Aug 13 15:02:16 2026 ===  0.000485 === command/int32-speed.c compiling gcc -fPIC -Wall -fomit-frame-pointer -fwrapv -O3
Thu Aug 13 15:02:16 2026 ===  0.067620 === command/int32-speed.c compiling gcc -fPIC -Wall -fomit-frame-pointer -fwrapv -march=core-avx2 -O3
Thu Aug 13 15:02:16 2026 ===  0.085068 === command/int32-speed.c compiling clang -fPIC -Wall -fomit-frame-pointer -fwrapv -Qunused-arguments -O3
Thu Aug 13 15:02:16 2026 ===  0.016333 === output
> gcc: error: unrecognized command-line option ‘-Qunused-arguments’
Thu Aug 13 15:02:16 2026 ===  0.000327 === command/int32-speed.c compiler exited 1
Thu Aug 13 15:02:16 2026 ===  0.000076 === command/int32-speed.c compiling clang -fPIC -Wall -fomit-frame-pointer -fwrapv -Qunused-arguments -mavx2 -O3
Thu Aug 13 15:02:16 2026 ===  0.012924 === output
> gcc: error: unrecognized command-line option ‘-Qunused-arguments’
Thu Aug 13 15:02:16 2026 ===  0.000212 === command/int32-speed.c compiler exited 1
Thu Aug 13 15:02:16 2026 ===  0.000452 === command/uint32-speed.c compiling gcc -fPIC -Wall -fomit-frame-pointer -fwrapv -O3
Thu Aug 13 15:02:16 2026 ===  0.074945 === command/uint32-speed.c compiling gcc -fPIC -Wall -fomit-frame-pointer -fwrapv -march=core-avx2 -O3
Thu Aug 13 15:02:16 2026 ===  0.088396 === command/uint32-speed.c compiling clang -fPIC -Wall -fomit-frame-pointer -fwrapv -Qunused-arguments -O3
Thu Aug 13 15:02:16 2026 ===  0.020249 === output
> gcc: error: unrecognized command-line option ‘-Qunused-arguments’
Thu Aug 13 15:02:16 2026 ===  0.000395 === command/uint32-speed.c compiler exited 1
Thu Aug 13 15:02:16 2026 ===  0.000084 === command/uint32-speed.c compiling clang -fPIC -Wall -fomit-frame-pointer -fwrapv -Qunused-arguments -mavx2 -O3
Thu Aug 13 15:02:16 2026 ===  0.013540 === output
> gcc: error: unrecognized command-line option ‘-Qunused-arguments’
Thu Aug 13 15:02:16 2026 ===  0.000314 === command/uint32-speed.c compiler exited 1
Thu Aug 13 15:02:16 2026 ===  0.000642 === command/float32-speed.c compiling gcc -fPIC -Wall -fomit-frame-pointer -fwrapv -O3
Thu Aug 13 15:02:17 2026 ===  0.080810 === command/float32-speed.c compiling gcc -fPIC -Wall -fomit-frame-pointer -fwrapv -march=core-avx2 -O3
Thu Aug 13 15:02:17 2026 ===  0.067367 === command/float32-speed.c compiling clang -fPIC -Wall -fomit-frame-pointer -fwrapv -Qunused-arguments -O3
Thu Aug 13 15:02:17 2026 ===  0.020960 === output
> gcc: error: unrecognized command-line option ‘-Qunused-arguments’
Thu Aug 13 15:02:17 2026 ===  0.000339 === command/float32-speed.c compiler exited 1
Thu Aug 13 15:02:17 2026 ===  0.000296 === command/float32-speed.c compiling clang -fPIC -Wall -fomit-frame-pointer -fwrapv -Qunused-arguments -mavx2 -O3
Thu Aug 13 15:02:17 2026 ===  0.017035 === output
> gcc: error: unrecognized command-line option ‘-Qunused-arguments’
Thu Aug 13 15:02:17 2026 ===  0.000340 === command/float32-speed.c compiler exited 1
Thu Aug 13 15:02:17 2026 ===  0.000266 === build finishing successfully
