Tue Oct  6 21:30:13 2026 ===  0.000000 === build starting
Tue Oct  6 21:30:13 2026 ===  0.000233 === version 20190516
Tue Oct  6 21:30:13 2026 ===  0.000099 === hostname pkgsrchostname
Tue Oct  6 21:30:13 2026 ===  0.001741 === compilers/abiname.c compiling gcc -fPIC -Wall -fomit-frame-pointer -fwrapv -O3
Tue Oct  6 21:30:13 2026 ===  0.276116 === compilers/abiname.c compiling gcc -fPIC -Wall -fomit-frame-pointer -fwrapv -march=core-avx2 -O3
Tue Oct  6 21:30:13 2026 ===  0.042943 === output
> cc1: error: unknown value ‘core-avx2’ for ‘-march’
> cc1: note: valid arguments are: armv8-a armv8.1-a armv8.2-a armv8.3-a armv8.4-a armv8.5-a armv8.6-a armv8.7-a armv8.8-a armv8-r armv9-a native
Tue Oct  6 21:30:13 2026 ===  0.010383 === compilers/abiname.c compiler exited 1
Tue Oct  6 21:30:13 2026 ===  0.042383 === output
> cc1: error: unknown value ‘core-avx2’ for ‘-march’
> cc1: note: valid arguments are: armv8-a armv8.1-a armv8.2-a armv8.3-a armv8.4-a armv8.5-a armv8.6-a armv8.7-a armv8.8-a armv8-r armv9-a native
Tue Oct  6 21:30:13 2026 ===  0.009130 === compilers/base.c compiler exited 1
Tue Oct  6 21:30:13 2026 ===  0.022071 === compilers/abiname.c compiling clang -fPIC -Wall -fomit-frame-pointer -fwrapv -Qunused-arguments -O3
Tue Oct  6 21:30:13 2026 ===  0.037345 === output
> gcc: error: unrecognized command-line option ‘-Qunused-arguments’
Tue Oct  6 21:30:13 2026 ===  0.009148 === compilers/abiname.c compiler exited 1
Tue Oct  6 21:30:13 2026 ===  0.040920 === output
> gcc: error: unrecognized command-line option ‘-Qunused-arguments’
Tue Oct  6 21:30:13 2026 ===  0.006596 === compilers/base.c compiler exited 1
Tue Oct  6 21:30:13 2026 ===  0.019988 === compilers/abiname.c compiling clang -fPIC -Wall -fomit-frame-pointer -fwrapv -Qunused-arguments -mavx2 -O3
Tue Oct  6 21:30:13 2026 ===  0.040212 === output
> gcc: error: unrecognized command-line option ‘-Qunused-arguments’
> gcc: error: unrecognized command-line option ‘-mavx2’
Tue Oct  6 21:30:13 2026 ===  0.008421 === compilers/abiname.c compiler exited 1
Tue Oct  6 21:30:13 2026 ===  0.041511 === output
> gcc: error: unrecognized command-line option ‘-Qunused-arguments’
> gcc: error: unrecognized command-line option ‘-mavx2’
Tue Oct  6 21:30:13 2026 ===  0.001399 === compilers/base.c compiler exited 1
Tue Oct  6 21:30:13 2026 ===  0.018562 === cpucycles/amd64cpuinfo skipping architecture gcc -fPIC -Wall -fomit-frame-pointer -fwrapv -O3
Tue Oct  6 21:30:13 2026 ===  0.000417 === cpucycles/amd64cpuinfo skipping architecture gcc -fPIC -Wall -fomit-frame-pointer -fwrapv -march=core-avx2 -O3
Tue Oct  6 21:30:13 2026 ===  0.000294 === cpucycles/amd64cpuinfo skipping architecture clang -fPIC -Wall -fomit-frame-pointer -fwrapv -Qunused-arguments -O3
Tue Oct  6 21:30:13 2026 ===  0.000290 === cpucycles/amd64cpuinfo skipping architecture clang -fPIC -Wall -fomit-frame-pointer -fwrapv -Qunused-arguments -mavx2 -O3
Tue Oct  6 21:30:13 2026 ===  0.000357 === cpucycles/amd64cpuspeed skipping architecture gcc -fPIC -Wall -fomit-frame-pointer -fwrapv -O3
Tue Oct  6 21:30:13 2026 ===  0.000279 === cpucycles/amd64cpuspeed skipping architecture gcc -fPIC -Wall -fomit-frame-pointer -fwrapv -march=core-avx2 -O3
Tue Oct  6 21:30:13 2026 ===  0.000281 === cpucycles/amd64cpuspeed skipping architecture clang -fPIC -Wall -fomit-frame-pointer -fwrapv -Qunused-arguments -O3
Tue Oct  6 21:30:13 2026 ===  0.000317 === cpucycles/amd64cpuspeed skipping architecture clang -fPIC -Wall -fomit-frame-pointer -fwrapv -Qunused-arguments -mavx2 -O3
Tue Oct  6 21:30:13 2026 ===  0.000394 === cpucycles/amd64tscfreq skipping architecture gcc -fPIC -Wall -fomit-frame-pointer -fwrapv -O3
Tue Oct  6 21:30:13 2026 ===  0.000286 === cpucycles/amd64tscfreq skipping architecture gcc -fPIC -Wall -fomit-frame-pointer -fwrapv -march=core-avx2 -O3
Tue Oct  6 21:30:13 2026 ===  0.000274 === cpucycles/amd64tscfreq skipping architecture clang -fPIC -Wall -fomit-frame-pointer -fwrapv -Qunused-arguments -O3
Tue Oct  6 21:30:13 2026 ===  0.000264 === cpucycles/amd64tscfreq skipping architecture clang -fPIC -Wall -fomit-frame-pointer -fwrapv -Qunused-arguments -mavx2 -O3
Tue Oct  6 21:30:13 2026 ===  0.000214 === cpucycles/apple compiling gcc -fPIC -Wall -fomit-frame-pointer -fwrapv -O3
Tue Oct  6 21:30:14 2026 ===  0.134992 === output
> cpucycles.c:6:10: fatal error: mach/mach_time.h: No such file or directory
>     6 | #include <mach/mach_time.h>
>       |          ^~~~~~~~~~~~~~~~~~
> compilation terminated.
Tue Oct  6 21:30:14 2026 ===  0.008130 === cpucycles/cpucycles.c compiler exited 1
Tue Oct  6 21:30:14 2026 ===  0.000347 === cpucycles/apple compiling gcc -fPIC -Wall -fomit-frame-pointer -fwrapv -march=core-avx2 -O3
Tue Oct  6 21:30:14 2026 ===  0.065969 === output
> cc1: error: unknown value ‘core-avx2’ for ‘-march’
> cc1: note: valid arguments are: armv8-a armv8.1-a armv8.2-a armv8.3-a armv8.4-a armv8.5-a armv8.6-a armv8.7-a armv8.8-a armv8-r armv9-a native
Tue Oct  6 21:30:14 2026 ===  0.007624 === cpucycles/cpucycles.c compiler exited 1
Tue Oct  6 21:30:14 2026 ===  0.000661 === cpucycles/apple compiling clang -fPIC -Wall -fomit-frame-pointer -fwrapv -Qunused-arguments -O3
Tue Oct  6 21:30:14 2026 ===  0.061735 === output
> gcc: error: unrecognized command-line option ‘-Qunused-arguments’
Tue Oct  6 21:30:14 2026 ===  0.003862 === cpucycles/cpucycles.c compiler exited 1
Tue Oct  6 21:30:14 2026 ===  0.000672 === cpucycles/apple compiling clang -fPIC -Wall -fomit-frame-pointer -fwrapv -Qunused-arguments -mavx2 -O3
Tue Oct  6 21:30:14 2026 ===  0.057548 === output
> gcc: error: unrecognized command-line option ‘-Qunused-arguments’
> gcc: error: unrecognized command-line option ‘-mavx2’
Tue Oct  6 21:30:14 2026 ===  0.003576 === cpucycles/cpucycles.c compiler exited 1
Tue Oct  6 21:30:14 2026 ===  0.000660 === cpucycles/celllinux skipping architecture gcc -fPIC -Wall -fomit-frame-pointer -fwrapv -O3
Tue Oct  6 21:30:14 2026 ===  0.000327 === cpucycles/celllinux skipping architecture gcc -fPIC -Wall -fomit-frame-pointer -fwrapv -march=core-avx2 -O3
Tue Oct  6 21:30:14 2026 ===  0.000292 === cpucycles/celllinux skipping architecture clang -fPIC -Wall -fomit-frame-pointer -fwrapv -Qunused-arguments -O3
Tue Oct  6 21:30:14 2026 ===  0.000289 === cpucycles/celllinux skipping architecture clang -fPIC -Wall -fomit-frame-pointer -fwrapv -Qunused-arguments -mavx2 -O3
Tue Oct  6 21:30:14 2026 ===  0.000357 === cpucycles/cortex compiling gcc -fPIC -Wall -fomit-frame-pointer -fwrapv -O3
Tue Oct  6 21:30:14 2026 ===  0.160938 === output
> cpucycles.c:29:18: warning: ‘cyclespersec’ defined but not used [-Wunused-variable]
>    29 | static long long cyclespersec = 0;
>       |                  ^~~~~~~~~~~~
> cpucycles.c:28:12: warning: ‘now’ defined but not used [-Wunused-variable]
>    28 | static int now[3];
>       |            ^~~
> cpucycles.c:27:27: warning: ‘prevcycles’ defined but not used [-Wunused-variable]
>    27 | static unsigned long long prevcycles = 0;
>       |                           ^~~~~~~~~~
> cpucycles.c:26:12: warning: ‘prev’ defined but not used [-Wunused-variable]
>    26 | static int prev[3];
>       |            ^~~~
> cpucycles.c:24:12: warning: ‘enabled’ defined but not used [-Wunused-variable]
>    24 | static int enabled = 0;
>       |            ^~~~~~~
Tue Oct  6 21:30:14 2026 ===  0.387513 === cpucycles/cortex compiling gcc -fPIC -Wall -fomit-frame-pointer -fwrapv -march=core-avx2 -O3
Tue Oct  6 21:30:14 2026 ===  0.056319 === output
> cc1: error: unknown value ‘core-avx2’ for ‘-march’
> cc1: note: valid arguments are: armv8-a armv8.1-a armv8.2-a armv8.3-a armv8.4-a armv8.5-a armv8.6-a armv8.7-a armv8.8-a armv8-r armv9-a native
Tue Oct  6 21:30:14 2026 ===  0.001197 === cpucycles/cpucycles.c compiler exited 1
Tue Oct  6 21:30:14 2026 ===  0.000541 === cpucycles/cortex compiling clang -fPIC -Wall -fomit-frame-pointer -fwrapv -Qunused-arguments -O3
Tue Oct  6 21:30:15 2026 ===  0.051318 === output
> gcc: error: unrecognized command-line option ‘-Qunused-arguments’
Tue Oct  6 21:30:15 2026 ===  0.002842 === cpucycles/cpucycles.c compiler exited 1
Tue Oct  6 21:30:15 2026 ===  0.000685 === cpucycles/cortex compiling clang -fPIC -Wall -fomit-frame-pointer -fwrapv -Qunused-arguments -mavx2 -O3
Tue Oct  6 21:30:15 2026 ===  0.061178 === output
> gcc: error: unrecognized command-line option ‘-Qunused-arguments’
> gcc: error: unrecognized command-line option ‘-mavx2’
Tue Oct  6 21:30:15 2026 ===  0.001634 === cpucycles/cpucycles.c compiler exited 1
Tue Oct  6 21:30:15 2026 ===  0.000639 === cpucycles/cortex_vct compiling gcc -fPIC -Wall -fomit-frame-pointer -fwrapv -O3
Tue Oct  6 21:30:15 2026 ===  0.652813 === cpucycles/cortex_vct compiling gcc -fPIC -Wall -fomit-frame-pointer -fwrapv -march=core-avx2 -O3
Tue Oct  6 21:30:15 2026 ===  0.062644 === output
> cc1: error: unknown value ‘core-avx2’ for ‘-march’
> cc1: note: valid arguments are: armv8-a armv8.1-a armv8.2-a armv8.3-a armv8.4-a armv8.5-a armv8.6-a armv8.7-a armv8.8-a armv8-r armv9-a native
Tue Oct  6 21:30:15 2026 ===  0.004618 === cpucycles/cpucycles.c compiler exited 1
Tue Oct  6 21:30:15 2026 ===  0.000585 === cpucycles/cortex_vct compiling clang -fPIC -Wall -fomit-frame-pointer -fwrapv -Qunused-arguments -O3
Tue Oct  6 21:30:15 2026 ===  0.074455 === output
> gcc: error: unrecognized command-line option ‘-Qunused-arguments’
Tue Oct  6 21:30:15 2026 ===  0.007199 === cpucycles/cpucycles.c compiler exited 1
Tue Oct  6 21:30:15 2026 ===  0.000627 === cpucycles/cortex_vct compiling clang -fPIC -Wall -fomit-frame-pointer -fwrapv -Qunused-arguments -mavx2 -O3
Tue Oct  6 21:30:15 2026 ===  0.049259 === output
> gcc: error: unrecognized command-line option ‘-Qunused-arguments’
> gcc: error: unrecognized command-line option ‘-mavx2’
Tue Oct  6 21:30:15 2026 ===  0.002615 === cpucycles/cpucycles.c compiler exited 1
Tue Oct  6 21:30:15 2026 ===  0.000354 === cpucycles/dev4ns compiling gcc -fPIC -Wall -fomit-frame-pointer -fwrapv -O3
Tue Oct  6 21:30:16 2026 ===  0.607013 === cpucycles/dev4ns compiling gcc -fPIC -Wall -fomit-frame-pointer -fwrapv -march=core-avx2 -O3
Tue Oct  6 21:30:16 2026 ===  0.115640 === output
> cc1: error: unknown value ‘core-avx2’ for ‘-march’
> cc1: note: valid arguments are: armv8-a armv8.1-a armv8.2-a armv8.3-a armv8.4-a armv8.5-a armv8.6-a armv8.7-a armv8.8-a armv8-r armv9-a native
Tue Oct  6 21:30:16 2026 ===  0.001245 === cpucycles/cpucycles.c compiler exited 1
Tue Oct  6 21:30:16 2026 ===  0.000254 === cpucycles/dev4ns compiling clang -fPIC -Wall -fomit-frame-pointer -fwrapv -Qunused-arguments -O3
Tue Oct  6 21:30:16 2026 ===  0.056596 === output
> gcc: error: unrecognized command-line option ‘-Qunused-arguments’
Tue Oct  6 21:30:16 2026 ===  0.009805 === cpucycles/cpucycles.c compiler exited 1
Tue Oct  6 21:30:16 2026 ===  0.000331 === cpucycles/dev4ns compiling clang -fPIC -Wall -fomit-frame-pointer -fwrapv -Qunused-arguments -mavx2 -O3
Tue Oct  6 21:30:16 2026 ===  0.060604 === output
> gcc: error: unrecognized command-line option ‘-Qunused-arguments’
> gcc: error: unrecognized command-line option ‘-mavx2’
Tue Oct  6 21:30:16 2026 ===  0.003436 === cpucycles/cpucycles.c compiler exited 1
Tue Oct  6 21:30:16 2026 ===  0.000372 === cpucycles/gettimeofday compiling gcc -fPIC -Wall -fomit-frame-pointer -fwrapv -O3
Tue Oct  6 21:30:17 2026 ===  0.701650 === cpucycles/gettimeofday compiling gcc -fPIC -Wall -fomit-frame-pointer -fwrapv -march=core-avx2 -O3
Tue Oct  6 21:30:17 2026 ===  0.063033 === output
> cc1: error: unknown value ‘core-avx2’ for ‘-march’
> cc1: note: valid arguments are: armv8-a armv8.1-a armv8.2-a armv8.3-a armv8.4-a armv8.5-a armv8.6-a armv8.7-a armv8.8-a armv8-r armv9-a native
Tue Oct  6 21:30:17 2026 ===  0.003761 === cpucycles/cpucycles.c compiler exited 1
Tue Oct  6 21:30:17 2026 ===  0.000295 === cpucycles/gettimeofday compiling clang -fPIC -Wall -fomit-frame-pointer -fwrapv -Qunused-arguments -O3
Tue Oct  6 21:30:17 2026 ===  0.060524 === output
> gcc: error: unrecognized command-line option ‘-Qunused-arguments’
Tue Oct  6 21:30:17 2026 ===  0.001380 === cpucycles/cpucycles.c compiler exited 1
Tue Oct  6 21:30:17 2026 ===  0.000260 === cpucycles/gettimeofday compiling clang -fPIC -Wall -fomit-frame-pointer -fwrapv -Qunused-arguments -mavx2 -O3
Tue Oct  6 21:30:17 2026 ===  0.056772 === output
> gcc: error: unrecognized command-line option ‘-Qunused-arguments’
> gcc: error: unrecognized command-line option ‘-mavx2’
Tue Oct  6 21:30:17 2026 ===  0.001561 === cpucycles/cpucycles.c compiler exited 1
Tue Oct  6 21:30:17 2026 ===  0.000623 === cpucycles/ia64cpuinfo skipping architecture gcc -fPIC -Wall -fomit-frame-pointer -fwrapv -O3
Tue Oct  6 21:30:17 2026 ===  0.000315 === cpucycles/ia64cpuinfo skipping architecture gcc -fPIC -Wall -fomit-frame-pointer -fwrapv -march=core-avx2 -O3
Tue Oct  6 21:30:17 2026 ===  0.000288 === cpucycles/ia64cpuinfo skipping architecture clang -fPIC -Wall -fomit-frame-pointer -fwrapv -Qunused-arguments -O3
Tue Oct  6 21:30:17 2026 ===  0.000278 === cpucycles/ia64cpuinfo skipping architecture clang -fPIC -Wall -fomit-frame-pointer -fwrapv -Qunused-arguments -mavx2 -O3
Tue Oct  6 21:30:17 2026 ===  0.000315 === cpucycles/mips skipping architecture gcc -fPIC -Wall -fomit-frame-pointer -fwrapv -O3
Tue Oct  6 21:30:17 2026 ===  0.000299 === cpucycles/mips skipping architecture gcc -fPIC -Wall -fomit-frame-pointer -fwrapv -march=core-avx2 -O3
Tue Oct  6 21:30:17 2026 ===  0.000291 === cpucycles/mips skipping architecture clang -fPIC -Wall -fomit-frame-pointer -fwrapv -Qunused-arguments -O3
Tue Oct  6 21:30:17 2026 ===  0.000283 === cpucycles/mips skipping architecture clang -fPIC -Wall -fomit-frame-pointer -fwrapv -Qunused-arguments -mavx2 -O3
Tue Oct  6 21:30:17 2026 ===  0.000204 === cpucycles/monotonic compiling gcc -fPIC -Wall -fomit-frame-pointer -fwrapv -O3
Tue Oct  6 21:30:18 2026 ===  0.536160 === cpucycles/monotonic compiling gcc -fPIC -Wall -fomit-frame-pointer -fwrapv -march=core-avx2 -O3
Tue Oct  6 21:30:18 2026 ===  0.061773 === output
> cc1: error: unknown value ‘core-avx2’ for ‘-march’
> cc1: note: valid arguments are: armv8-a armv8.1-a armv8.2-a armv8.3-a armv8.4-a armv8.5-a armv8.6-a armv8.7-a armv8.8-a armv8-r armv9-a native
Tue Oct  6 21:30:18 2026 ===  0.001194 === cpucycles/cpucycles.c compiler exited 1
Tue Oct  6 21:30:18 2026 ===  0.000235 === cpucycles/monotonic compiling clang -fPIC -Wall -fomit-frame-pointer -fwrapv -Qunused-arguments -O3
Tue Oct  6 21:30:18 2026 ===  0.053587 === output
> gcc: error: unrecognized command-line option ‘-Qunused-arguments’
Tue Oct  6 21:30:18 2026 ===  0.001253 === cpucycles/cpucycles.c compiler exited 1
Tue Oct  6 21:30:18 2026 ===  0.000264 === cpucycles/monotonic compiling clang -fPIC -Wall -fomit-frame-pointer -fwrapv -Qunused-arguments -mavx2 -O3
Tue Oct  6 21:30:18 2026 ===  0.050590 === output
> gcc: error: unrecognized command-line option ‘-Qunused-arguments’
> gcc: error: unrecognized command-line option ‘-mavx2’
Tue Oct  6 21:30:18 2026 ===  0.001935 === cpucycles/cpucycles.c compiler exited 1
Tue Oct  6 21:30:18 2026 ===  0.000312 === cpucycles/monotoniccpuinfo compiling gcc -fPIC -Wall -fomit-frame-pointer -fwrapv -O3
Tue Oct  6 21:30:19 2026 ===  0.748240 === cpucycles/monotoniccpuinfo compiling gcc -fPIC -Wall -fomit-frame-pointer -fwrapv -march=core-avx2 -O3
Tue Oct  6 21:30:19 2026 ===  0.097024 === output
> cc1: error: unknown value ‘core-avx2’ for ‘-march’
> cc1: note: valid arguments are: armv8-a armv8.1-a armv8.2-a armv8.3-a armv8.4-a armv8.5-a armv8.6-a armv8.7-a armv8.8-a armv8-r armv9-a native
Tue Oct  6 21:30:19 2026 ===  0.040156 === cpucycles/cpucycles.c compiler exited 1
Tue Oct  6 21:30:19 2026 ===  0.000304 === cpucycles/monotoniccpuinfo compiling clang -fPIC -Wall -fomit-frame-pointer -fwrapv -Qunused-arguments -O3
Tue Oct  6 21:30:19 2026 ===  0.060677 === output
> gcc: error: unrecognized command-line option ‘-Qunused-arguments’
Tue Oct  6 21:30:19 2026 ===  0.002233 === cpucycles/cpucycles.c compiler exited 1
Tue Oct  6 21:30:19 2026 ===  0.000232 === cpucycles/monotoniccpuinfo compiling clang -fPIC -Wall -fomit-frame-pointer -fwrapv -Qunused-arguments -mavx2 -O3
Tue Oct  6 21:30:19 2026 ===  0.050351 === output
> gcc: error: unrecognized command-line option ‘-Qunused-arguments’
> gcc: error: unrecognized command-line option ‘-mavx2’
Tue Oct  6 21:30:19 2026 ===  0.001124 === cpucycles/cpucycles.c compiler exited 1
Tue Oct  6 21:30:19 2026 ===  0.000336 === cpucycles/perfevent compiling gcc -fPIC -Wall -fomit-frame-pointer -fwrapv -O3
Tue Oct  6 21:30:19 2026 ===  0.130520 === output
> cpucycles.c:6:10: fatal error: linux/perf_event.h: No such file or directory
>     6 | #include <linux/perf_event.h>
>       |          ^~~~~~~~~~~~~~~~~~~~
> compilation terminated.
Tue Oct  6 21:30:19 2026 ===  0.002422 === cpucycles/cpucycles.c compiler exited 1
Tue Oct  6 21:30:19 2026 ===  0.000490 === cpucycles/perfevent compiling gcc -fPIC -Wall -fomit-frame-pointer -fwrapv -march=core-avx2 -O3
Tue Oct  6 21:30:19 2026 ===  0.080582 === output
> cc1: error: unknown value ‘core-avx2’ for ‘-march’
> cc1: note: valid arguments are: armv8-a armv8.1-a armv8.2-a armv8.3-a armv8.4-a armv8.5-a armv8.6-a armv8.7-a armv8.8-a armv8-r armv9-a native
Tue Oct  6 21:30:19 2026 ===  0.003506 === cpucycles/cpucycles.c compiler exited 1
Tue Oct  6 21:30:19 2026 ===  0.000281 === cpucycles/perfevent compiling clang -fPIC -Wall -fomit-frame-pointer -fwrapv -Qunused-arguments -O3
Tue Oct  6 21:30:19 2026 ===  0.052783 === output
> gcc: error: unrecognized command-line option ‘-Qunused-arguments’
Tue Oct  6 21:30:19 2026 ===  0.006336 === cpucycles/cpucycles.c compiler exited 1
Tue Oct  6 21:30:19 2026 ===  0.000308 === cpucycles/perfevent compiling clang -fPIC -Wall -fomit-frame-pointer -fwrapv -Qunused-arguments -mavx2 -O3
Tue Oct  6 21:30:19 2026 ===  0.099325 === output
> gcc: error: unrecognized command-line option ‘-Qunused-arguments’
> gcc: error: unrecognized command-line option ‘-mavx2’
Tue Oct  6 21:30:19 2026 ===  0.004903 === cpucycles/cpucycles.c compiler exited 1
Tue Oct  6 21:30:19 2026 ===  0.000712 === cpucycles/powerpccpuinfo skipping architecture gcc -fPIC -Wall -fomit-frame-pointer -fwrapv -O3
Tue Oct  6 21:30:19 2026 ===  0.000347 === cpucycles/powerpccpuinfo skipping architecture gcc -fPIC -Wall -fomit-frame-pointer -fwrapv -march=core-avx2 -O3
Tue Oct  6 21:30:19 2026 ===  0.000303 === cpucycles/powerpccpuinfo skipping architecture clang -fPIC -Wall -fomit-frame-pointer -fwrapv -Qunused-arguments -O3
Tue Oct  6 21:30:19 2026 ===  0.000301 === cpucycles/powerpccpuinfo skipping architecture clang -fPIC -Wall -fomit-frame-pointer -fwrapv -Qunused-arguments -mavx2 -O3
Tue Oct  6 21:30:19 2026 ===  0.000362 === cpucycles/powerpcmacos skipping architecture gcc -fPIC -Wall -fomit-frame-pointer -fwrapv -O3
Tue Oct  6 21:30:19 2026 ===  0.000308 === cpucycles/powerpcmacos skipping architecture gcc -fPIC -Wall -fomit-frame-pointer -fwrapv -march=core-avx2 -O3
Tue Oct  6 21:30:19 2026 ===  0.000295 === cpucycles/powerpcmacos skipping architecture clang -fPIC -Wall -fomit-frame-pointer -fwrapv -Qunused-arguments -O3
Tue Oct  6 21:30:19 2026 ===  0.000291 === cpucycles/powerpcmacos skipping architecture clang -fPIC -Wall -fomit-frame-pointer -fwrapv -Qunused-arguments -mavx2 -O3
Tue Oct  6 21:30:19 2026 ===  0.000349 === cpucycles/sparc32cpuinfo skipping architecture gcc -fPIC -Wall -fomit-frame-pointer -fwrapv -O3
Tue Oct  6 21:30:19 2026 ===  0.000283 === cpucycles/sparc32cpuinfo skipping architecture gcc -fPIC -Wall -fomit-frame-pointer -fwrapv -march=core-avx2 -O3
Tue Oct  6 21:30:19 2026 ===  0.000308 === cpucycles/sparc32cpuinfo skipping architecture clang -fPIC -Wall -fomit-frame-pointer -fwrapv -Qunused-arguments -O3
Tue Oct  6 21:30:19 2026 ===  0.000291 === cpucycles/sparc32cpuinfo skipping architecture clang -fPIC -Wall -fomit-frame-pointer -fwrapv -Qunused-arguments -mavx2 -O3
Tue Oct  6 21:30:19 2026 ===  0.000358 === cpucycles/sparccpuinfo skipping architecture gcc -fPIC -Wall -fomit-frame-pointer -fwrapv -O3
Tue Oct  6 21:30:19 2026 ===  0.000273 === cpucycles/sparccpuinfo skipping architecture gcc -fPIC -Wall -fomit-frame-pointer -fwrapv -march=core-avx2 -O3
Tue Oct  6 21:30:19 2026 ===  0.000293 === cpucycles/sparccpuinfo skipping architecture clang -fPIC -Wall -fomit-frame-pointer -fwrapv -Qunused-arguments -O3
Tue Oct  6 21:30:19 2026 ===  0.000294 === cpucycles/sparccpuinfo skipping architecture clang -fPIC -Wall -fomit-frame-pointer -fwrapv -Qunused-arguments -mavx2 -O3
Tue Oct  6 21:30:19 2026 ===  0.000389 === cpucycles/vct compiling gcc -fPIC -Wall -fomit-frame-pointer -fwrapv -O3
Tue Oct  6 21:30:20 2026 ===  0.736959 === cpucycles/vct compiling gcc -fPIC -Wall -fomit-frame-pointer -fwrapv -march=core-avx2 -O3
Tue Oct  6 21:30:20 2026 ===  0.071189 === output
> cc1: error: unknown value ‘core-avx2’ for ‘-march’
> cc1: note: valid arguments are: armv8-a armv8.1-a armv8.2-a armv8.3-a armv8.4-a armv8.5-a armv8.6-a armv8.7-a armv8.8-a armv8-r armv9-a native
Tue Oct  6 21:30:20 2026 ===  0.003006 === cpucycles/cpucycles.c compiler exited 1
Tue Oct  6 21:30:20 2026 ===  0.000495 === cpucycles/vct compiling clang -fPIC -Wall -fomit-frame-pointer -fwrapv -Qunused-arguments -O3
Tue Oct  6 21:30:20 2026 ===  0.067133 === output
> gcc: error: unrecognized command-line option ‘-Qunused-arguments’
Tue Oct  6 21:30:20 2026 ===  0.001130 === cpucycles/cpucycles.c compiler exited 1
Tue Oct  6 21:30:20 2026 ===  0.000540 === cpucycles/vct compiling clang -fPIC -Wall -fomit-frame-pointer -fwrapv -Qunused-arguments -mavx2 -O3
Tue Oct  6 21:30:20 2026 ===  0.059332 === output
> gcc: error: unrecognized command-line option ‘-Qunused-arguments’
> gcc: error: unrecognized command-line option ‘-mavx2’
Tue Oct  6 21:30:20 2026 ===  0.004984 === cpucycles/cpucycles.c compiler exited 1
Tue Oct  6 21:30:20 2026 ===  0.002530 === cpucycles/x86cpuinfo skipping architecture gcc -fPIC -Wall -fomit-frame-pointer -fwrapv -O3
Tue Oct  6 21:30:20 2026 ===  0.000337 === cpucycles/x86cpuinfo skipping architecture gcc -fPIC -Wall -fomit-frame-pointer -fwrapv -march=core-avx2 -O3
Tue Oct  6 21:30:20 2026 ===  0.000300 === cpucycles/x86cpuinfo skipping architecture clang -fPIC -Wall -fomit-frame-pointer -fwrapv -Qunused-arguments -O3
Tue Oct  6 21:30:20 2026 ===  0.000287 === cpucycles/x86cpuinfo skipping architecture clang -fPIC -Wall -fomit-frame-pointer -fwrapv -Qunused-arguments -mavx2 -O3
Tue Oct  6 21:30:20 2026 ===  0.000372 === cpucycles/x86cpuspeed skipping architecture gcc -fPIC -Wall -fomit-frame-pointer -fwrapv -O3
Tue Oct  6 21:30:20 2026 ===  0.000251 === cpucycles/x86cpuspeed skipping architecture gcc -fPIC -Wall -fomit-frame-pointer -fwrapv -march=core-avx2 -O3
Tue Oct  6 21:30:20 2026 ===  0.000255 === cpucycles/x86cpuspeed skipping architecture clang -fPIC -Wall -fomit-frame-pointer -fwrapv -Qunused-arguments -O3
Tue Oct  6 21:30:20 2026 ===  0.000261 === cpucycles/x86cpuspeed skipping architecture clang -fPIC -Wall -fomit-frame-pointer -fwrapv -Qunused-arguments -mavx2 -O3
Tue Oct  6 21:30:20 2026 ===  0.000306 === cpucycles/x86estimate skipping architecture gcc -fPIC -Wall -fomit-frame-pointer -fwrapv -O3
Tue Oct  6 21:30:20 2026 ===  0.000267 === cpucycles/x86estimate skipping architecture gcc -fPIC -Wall -fomit-frame-pointer -fwrapv -march=core-avx2 -O3
Tue Oct  6 21:30:20 2026 ===  0.000275 === cpucycles/x86estimate skipping architecture clang -fPIC -Wall -fomit-frame-pointer -fwrapv -Qunused-arguments -O3
Tue Oct  6 21:30:20 2026 ===  0.000292 === cpucycles/x86estimate skipping architecture clang -fPIC -Wall -fomit-frame-pointer -fwrapv -Qunused-arguments -mavx2 -O3
Tue Oct  6 21:30:20 2026 ===  0.000327 === cpucycles/x86tscfreq skipping architecture gcc -fPIC -Wall -fomit-frame-pointer -fwrapv -O3
Tue Oct  6 21:30:20 2026 ===  0.000265 === cpucycles/x86tscfreq skipping architecture gcc -fPIC -Wall -fomit-frame-pointer -fwrapv -march=core-avx2 -O3
Tue Oct  6 21:30:20 2026 ===  0.000261 === cpucycles/x86tscfreq skipping architecture clang -fPIC -Wall -fomit-frame-pointer -fwrapv -Qunused-arguments -O3
Tue Oct  6 21:30:20 2026 ===  0.000278 === cpucycles/x86tscfreq skipping architecture clang -fPIC -Wall -fomit-frame-pointer -fwrapv -Qunused-arguments -mavx2 -O3
Tue Oct  6 21:30:20 2026 ===  0.022637 === int32/avx2 skipping architecture gcc -fPIC -Wall -fomit-frame-pointer -fwrapv -O3
Tue Oct  6 21:30:20 2026 ===  0.000350 === int32/avx2 skipping architecture gcc -fPIC -Wall -fomit-frame-pointer -fwrapv -march=core-avx2 -O3
Tue Oct  6 21:30:20 2026 ===  0.000287 === int32/avx2 skipping architecture clang -fPIC -Wall -fomit-frame-pointer -fwrapv -Qunused-arguments -O3
Tue Oct  6 21:30:20 2026 ===  0.000291 === int32/avx2 skipping architecture clang -fPIC -Wall -fomit-frame-pointer -fwrapv -Qunused-arguments -mavx2 -O3
Tue Oct  6 21:30:20 2026 ===  0.031411 === int32/portable3 compiling gcc -fPIC -Wall -fomit-frame-pointer -fwrapv -O3
Tue Oct  6 21:30:20 2026 ===  0.006230 === int32/portable3/sort.c compiling
Tue Oct  6 21:30:20 2026 ===  0.189511 === int32/portable3/compiler.c compiling
Tue Oct  6 21:30:21 2026 ===  0.092943 === int32/portable3/version.c compiling
Tue Oct  6 21:30:21 2026 ===  0.097562 === int32/portable3/implementation.c compiling
Tue Oct  6 21:30:21 2026 ===  0.112308 === int32/portable3/cycles.c compiling
Tue Oct  6 21:30:21 2026 ===  0.290430 === int32/portable3/works.c compiling
Tue Oct  6 21:30:21 2026 ===  0.407446 === int32/portable3 compiled gcc -fPIC -Wall -fomit-frame-pointer -fwrapv -O3
Tue Oct  6 21:30:22 2026 ===  0.112852 === int32/portable3 compiling gcc -fPIC -Wall -fomit-frame-pointer -fwrapv -march=core-avx2 -O3
Tue Oct  6 21:30:22 2026 ===  0.001341 === int32/portable3/sort.c compiling
Tue Oct  6 21:30:22 2026 ===  0.042984 === output
> cc1: error: unknown value ‘core-avx2’ for ‘-march’
> cc1: note: valid arguments are: armv8-a armv8.1-a armv8.2-a armv8.3-a armv8.4-a armv8.5-a armv8.6-a armv8.7-a armv8.8-a armv8-r armv9-a native
Tue Oct  6 21:30:22 2026 ===  0.007837 === int32/portable3/sort.c compiler exited 1
Tue Oct  6 21:30:22 2026 ===  0.000238 === int32/portable3/compiler.c compiling
Tue Oct  6 21:30:22 2026 ===  0.041594 === output
> cc1: error: unknown value ‘core-avx2’ for ‘-march’
> cc1: note: valid arguments are: armv8-a armv8.1-a armv8.2-a armv8.3-a armv8.4-a armv8.5-a armv8.6-a armv8.7-a armv8.8-a armv8-r armv9-a native
Tue Oct  6 21:30:22 2026 ===  0.002711 === int32/portable3/compiler.c compiler exited 1
Tue Oct  6 21:30:22 2026 ===  0.000197 === int32/portable3/version.c compiling
Tue Oct  6 21:30:22 2026 ===  0.047162 === output
> cc1: error: unknown value ‘core-avx2’ for ‘-march’
> cc1: note: valid arguments are: armv8-a armv8.1-a armv8.2-a armv8.3-a armv8.4-a armv8.5-a armv8.6-a armv8.7-a armv8.8-a armv8-r armv9-a native
Tue Oct  6 21:30:22 2026 ===  0.477035 === int32/portable3/version.c compiler exited 1
Tue Oct  6 21:30:22 2026 ===  0.000211 === int32/portable3/implementation.c compiling
Tue Oct  6 21:30:22 2026 ===  0.094085 === output
> cc1: error: unknown value ‘core-avx2’ for ‘-march’
> cc1: note: valid arguments are: armv8-a armv8.1-a armv8.2-a armv8.3-a armv8.4-a armv8.5-a armv8.6-a armv8.7-a armv8.8-a armv8-r armv9-a native
Tue Oct  6 21:30:22 2026 ===  0.001298 === int32/portable3/implementation.c compiler exited 1
Tue Oct  6 21:30:22 2026 ===  0.000221 === int32/portable3/cycles.c compiling
Tue Oct  6 21:30:22 2026 ===  0.040239 === output
> cc1: error: unknown value ‘core-avx2’ for ‘-march’
> cc1: note: valid arguments are: armv8-a armv8.1-a armv8.2-a armv8.3-a armv8.4-a armv8.5-a armv8.6-a armv8.7-a armv8.8-a armv8-r armv9-a native
Tue Oct  6 21:30:22 2026 ===  0.001267 === int32/portable3/cycles.c compiler exited 1
Tue Oct  6 21:30:22 2026 ===  0.000180 === int32/portable3/works.c compiling
Tue Oct  6 21:30:22 2026 ===  0.042381 === output
> cc1: error: unknown value ‘core-avx2’ for ‘-march’
> cc1: note: valid arguments are: armv8-a armv8.1-a armv8.2-a armv8.3-a armv8.4-a armv8.5-a armv8.6-a armv8.7-a armv8.8-a armv8-r armv9-a native
Tue Oct  6 21:30:22 2026 ===  0.001325 === int32/portable3/works.c compiler exited 1
Tue Oct  6 21:30:22 2026 ===  0.000264 === int32/portable3 compiling clang -fPIC -Wall -fomit-frame-pointer -fwrapv -Qunused-arguments -O3
Tue Oct  6 21:30:22 2026 ===  0.000834 === int32/portable3/sort.c compiling
Tue Oct  6 21:30:22 2026 ===  0.033212 === output
> gcc: error: unrecognized command-line option ‘-Qunused-arguments’
Tue Oct  6 21:30:22 2026 ===  0.002738 === int32/portable3/sort.c compiler exited 1
Tue Oct  6 21:30:22 2026 ===  0.000193 === int32/portable3/compiler.c compiling
Tue Oct  6 21:30:22 2026 ===  0.057034 === output
> gcc: error: unrecognized command-line option ‘-Qunused-arguments’
Tue Oct  6 21:30:22 2026 ===  0.008325 === int32/portable3/compiler.c compiler exited 1
Tue Oct  6 21:30:22 2026 ===  0.000220 === int32/portable3/version.c compiling
Tue Oct  6 21:30:23 2026 ===  0.060023 === output
> gcc: error: unrecognized command-line option ‘-Qunused-arguments’
Tue Oct  6 21:30:23 2026 ===  0.001265 === int32/portable3/version.c compiler exited 1
Tue Oct  6 21:30:23 2026 ===  0.000201 === int32/portable3/implementation.c compiling
Tue Oct  6 21:30:23 2026 ===  0.041844 === output
> gcc: error: unrecognized command-line option ‘-Qunused-arguments’
Tue Oct  6 21:30:23 2026 ===  0.001234 === int32/portable3/implementation.c compiler exited 1
Tue Oct  6 21:30:23 2026 ===  0.000220 === int32/portable3/cycles.c compiling
Tue Oct  6 21:30:23 2026 ===  0.034642 === output
> gcc: error: unrecognized command-line option ‘-Qunused-arguments’
Tue Oct  6 21:30:23 2026 ===  0.001426 === int32/portable3/cycles.c compiler exited 1
Tue Oct  6 21:30:23 2026 ===  0.000199 === int32/portable3/works.c compiling
Tue Oct  6 21:30:23 2026 ===  0.033585 === output
> gcc: error: unrecognized command-line option ‘-Qunused-arguments’
Tue Oct  6 21:30:23 2026 ===  0.001258 === int32/portable3/works.c compiler exited 1
Tue Oct  6 21:30:23 2026 ===  0.000266 === int32/portable3 compiling clang -fPIC -Wall -fomit-frame-pointer -fwrapv -Qunused-arguments -mavx2 -O3
Tue Oct  6 21:30:23 2026 ===  0.001301 === int32/portable3/sort.c compiling
Tue Oct  6 21:30:23 2026 ===  0.095823 === output
> gcc: error: unrecognized command-line option ‘-Qunused-arguments’
> gcc: error: unrecognized command-line option ‘-mavx2’
Tue Oct  6 21:30:23 2026 ===  0.002830 === int32/portable3/sort.c compiler exited 1
Tue Oct  6 21:30:23 2026 ===  0.000218 === int32/portable3/compiler.c compiling
Tue Oct  6 21:30:23 2026 ===  0.039562 === output
> gcc: error: unrecognized command-line option ‘-Qunused-arguments’
> gcc: error: unrecognized command-line option ‘-mavx2’
Tue Oct  6 21:30:23 2026 ===  0.001289 === int32/portable3/compiler.c compiler exited 1
Tue Oct  6 21:30:23 2026 ===  0.000211 === int32/portable3/version.c compiling
Tue Oct  6 21:30:23 2026 ===  0.036531 === output
> gcc: error: unrecognized command-line option ‘-Qunused-arguments’
> gcc: error: unrecognized command-line option ‘-mavx2’
Tue Oct  6 21:30:23 2026 ===  0.001275 === int32/portable3/version.c compiler exited 1
Tue Oct  6 21:30:23 2026 ===  0.000198 === int32/portable3/implementation.c compiling
Tue Oct  6 21:30:23 2026 ===  0.037347 === output
> gcc: error: unrecognized command-line option ‘-Qunused-arguments’
> gcc: error: unrecognized command-line option ‘-mavx2’
Tue Oct  6 21:30:23 2026 ===  0.001163 === int32/portable3/implementation.c compiler exited 1
Tue Oct  6 21:30:23 2026 ===  0.000189 === int32/portable3/cycles.c compiling
Tue Oct  6 21:30:23 2026 ===  0.034598 === output
> gcc: error: unrecognized command-line option ‘-Qunused-arguments’
> gcc: error: unrecognized command-line option ‘-mavx2’
Tue Oct  6 21:30:23 2026 ===  0.002394 === int32/portable3/cycles.c compiler exited 1
Tue Oct  6 21:30:23 2026 ===  0.000227 === int32/portable3/works.c compiling
Tue Oct  6 21:30:23 2026 ===  0.305706 === output
> gcc: error: unrecognized command-line option ‘-Qunused-arguments’
> gcc: error: unrecognized command-line option ‘-mavx2’
Tue Oct  6 21:30:23 2026 ===  0.007176 === int32/portable3/works.c compiler exited 1
Tue Oct  6 21:30:23 2026 ===  0.035308 === int32/portable4 compiling gcc -fPIC -Wall -fomit-frame-pointer -fwrapv -O3
Tue Oct  6 21:30:23 2026 ===  0.002523 === int32/portable4/sort.c compiling
Tue Oct  6 21:30:24 2026 ===  0.344299 === int32/portable4/compiler.c compiling
Tue Oct  6 21:30:24 2026 ===  0.185299 === int32/portable4/version.c compiling
Tue Oct  6 21:30:24 2026 ===  0.233232 === int32/portable4/implementation.c compiling
Tue Oct  6 21:30:24 2026 ===  0.223350 === int32/portable4/cycles.c compiling
Tue Oct  6 21:30:25 2026 ===  0.313498 === int32/portable4/works.c compiling
Tue Oct  6 21:30:25 2026 ===  0.404948 === int32/portable4 compiled gcc -fPIC -Wall -fomit-frame-pointer -fwrapv -O3
Tue Oct  6 21:30:25 2026 ===  0.055043 === int32/portable4 compiling gcc -fPIC -Wall -fomit-frame-pointer -fwrapv -march=core-avx2 -O3
Tue Oct  6 21:30:25 2026 ===  0.000861 === int32/portable4/sort.c compiling
Tue Oct  6 21:30:25 2026 ===  0.048989 === output
> cc1: error: unknown value ‘core-avx2’ for ‘-march’
> cc1: note: valid arguments are: armv8-a armv8.1-a armv8.2-a armv8.3-a armv8.4-a armv8.5-a armv8.6-a armv8.7-a armv8.8-a armv8-r armv9-a native
Tue Oct  6 21:30:25 2026 ===  0.001820 === int32/portable4/sort.c compiler exited 1
Tue Oct  6 21:30:25 2026 ===  0.000217 === int32/portable4/compiler.c compiling
Tue Oct  6 21:30:25 2026 ===  0.082530 === output
> cc1: error: unknown value ‘core-avx2’ for ‘-march’
> cc1: note: valid arguments are: armv8-a armv8.1-a armv8.2-a armv8.3-a armv8.4-a armv8.5-a armv8.6-a armv8.7-a armv8.8-a armv8-r armv9-a native
Tue Oct  6 21:30:25 2026 ===  0.022103 === int32/portable4/compiler.c compiler exited 1
Tue Oct  6 21:30:25 2026 ===  0.000224 === int32/portable4/version.c compiling
Tue Oct  6 21:30:25 2026 ===  0.043963 === output
> cc1: error: unknown value ‘core-avx2’ for ‘-march’
> cc1: note: valid arguments are: armv8-a armv8.1-a armv8.2-a armv8.3-a armv8.4-a armv8.5-a armv8.6-a armv8.7-a armv8.8-a armv8-r armv9-a native
Tue Oct  6 21:30:25 2026 ===  0.001163 === int32/portable4/version.c compiler exited 1
Tue Oct  6 21:30:25 2026 ===  0.000162 === int32/portable4/implementation.c compiling
Tue Oct  6 21:30:25 2026 ===  0.038106 === output
> cc1: error: unknown value ‘core-avx2’ for ‘-march’
> cc1: note: valid arguments are: armv8-a armv8.1-a armv8.2-a armv8.3-a armv8.4-a armv8.5-a armv8.6-a armv8.7-a armv8.8-a armv8-r armv9-a native
Tue Oct  6 21:30:25 2026 ===  0.001454 === int32/portable4/implementation.c compiler exited 1
Tue Oct  6 21:30:25 2026 ===  0.000207 === int32/portable4/cycles.c compiling
Tue Oct  6 21:30:25 2026 ===  0.038760 === output
> cc1: error: unknown value ‘core-avx2’ for ‘-march’
> cc1: note: valid arguments are: armv8-a armv8.1-a armv8.2-a armv8.3-a armv8.4-a armv8.5-a armv8.6-a armv8.7-a armv8.8-a armv8-r armv9-a native
Tue Oct  6 21:30:25 2026 ===  0.001606 === int32/portable4/cycles.c compiler exited 1
Tue Oct  6 21:30:25 2026 ===  0.000229 === int32/portable4/works.c compiling
Tue Oct  6 21:30:25 2026 ===  0.050372 === output
> cc1: error: unknown value ‘core-avx2’ for ‘-march’
> cc1: note: valid arguments are: armv8-a armv8.1-a armv8.2-a armv8.3-a armv8.4-a armv8.5-a armv8.6-a armv8.7-a armv8.8-a armv8-r armv9-a native
Tue Oct  6 21:30:25 2026 ===  0.001448 === int32/portable4/works.c compiler exited 1
Tue Oct  6 21:30:25 2026 ===  0.000268 === int32/portable4 compiling clang -fPIC -Wall -fomit-frame-pointer -fwrapv -Qunused-arguments -O3
Tue Oct  6 21:30:25 2026 ===  0.000918 === int32/portable4/sort.c compiling
Tue Oct  6 21:30:25 2026 ===  0.038653 === output
> gcc: error: unrecognized command-line option ‘-Qunused-arguments’
Tue Oct  6 21:30:25 2026 ===  0.001990 === int32/portable4/sort.c compiler exited 1
Tue Oct  6 21:30:25 2026 ===  0.000221 === int32/portable4/compiler.c compiling
Tue Oct  6 21:30:25 2026 ===  0.034446 === output
> gcc: error: unrecognized command-line option ‘-Qunused-arguments’
Tue Oct  6 21:30:25 2026 ===  0.001269 === int32/portable4/compiler.c compiler exited 1
Tue Oct  6 21:30:25 2026 ===  0.000201 === int32/portable4/version.c compiling
Tue Oct  6 21:30:25 2026 ===  0.042969 === output
> gcc: error: unrecognized command-line option ‘-Qunused-arguments’
Tue Oct  6 21:30:25 2026 ===  0.001238 === int32/portable4/version.c compiler exited 1
Tue Oct  6 21:30:25 2026 ===  0.000204 === int32/portable4/implementation.c compiling
Tue Oct  6 21:30:26 2026 ===  0.037519 === output
> gcc: error: unrecognized command-line option ‘-Qunused-arguments’
Tue Oct  6 21:30:26 2026 ===  0.001183 === int32/portable4/implementation.c compiler exited 1
Tue Oct  6 21:30:26 2026 ===  0.000211 === int32/portable4/cycles.c compiling
Tue Oct  6 21:30:26 2026 ===  0.039113 === output
> gcc: error: unrecognized command-line option ‘-Qunused-arguments’
Tue Oct  6 21:30:26 2026 ===  0.001452 === int32/portable4/cycles.c compiler exited 1
Tue Oct  6 21:30:26 2026 ===  0.000225 === int32/portable4/works.c compiling
Tue Oct  6 21:30:26 2026 ===  0.044101 === output
> gcc: error: unrecognized command-line option ‘-Qunused-arguments’
Tue Oct  6 21:30:26 2026 ===  0.001231 === int32/portable4/works.c compiler exited 1
Tue Oct  6 21:30:26 2026 ===  0.000270 === int32/portable4 compiling clang -fPIC -Wall -fomit-frame-pointer -fwrapv -Qunused-arguments -mavx2 -O3
Tue Oct  6 21:30:26 2026 ===  0.000751 === int32/portable4/sort.c compiling
Tue Oct  6 21:30:26 2026 ===  0.038331 === output
> gcc: error: unrecognized command-line option ‘-Qunused-arguments’
> gcc: error: unrecognized command-line option ‘-mavx2’
Tue Oct  6 21:30:26 2026 ===  0.001773 === int32/portable4/sort.c compiler exited 1
Tue Oct  6 21:30:26 2026 ===  0.000215 === int32/portable4/compiler.c compiling
Tue Oct  6 21:30:26 2026 ===  0.040694 === output
> gcc: error: unrecognized command-line option ‘-Qunused-arguments’
> gcc: error: unrecognized command-line option ‘-mavx2’
Tue Oct  6 21:30:26 2026 ===  0.001256 === int32/portable4/compiler.c compiler exited 1
Tue Oct  6 21:30:26 2026 ===  0.000215 === int32/portable4/version.c compiling
Tue Oct  6 21:30:26 2026 ===  0.037305 === output
> gcc: error: unrecognized command-line option ‘-Qunused-arguments’
> gcc: error: unrecognized command-line option ‘-mavx2’
Tue Oct  6 21:30:26 2026 ===  0.001211 === int32/portable4/version.c compiler exited 1
Tue Oct  6 21:30:26 2026 ===  0.000219 === int32/portable4/implementation.c compiling
Tue Oct  6 21:30:26 2026 ===  0.035462 === output
> gcc: error: unrecognized command-line option ‘-Qunused-arguments’
> gcc: error: unrecognized command-line option ‘-mavx2’
Tue Oct  6 21:30:26 2026 ===  0.001170 === int32/portable4/implementation.c compiler exited 1
Tue Oct  6 21:30:26 2026 ===  0.000209 === int32/portable4/cycles.c compiling
Tue Oct  6 21:30:26 2026 ===  0.037607 === output
> gcc: error: unrecognized command-line option ‘-Qunused-arguments’
> gcc: error: unrecognized command-line option ‘-mavx2’
Tue Oct  6 21:30:26 2026 ===  0.001255 === int32/portable4/cycles.c compiler exited 1
Tue Oct  6 21:30:26 2026 ===  0.000226 === int32/portable4/works.c compiling
Tue Oct  6 21:30:26 2026 ===  0.035452 === output
> gcc: error: unrecognized command-line option ‘-Qunused-arguments’
> gcc: error: unrecognized command-line option ‘-mavx2’
Tue Oct  6 21:30:26 2026 ===  0.001303 === int32/portable4/works.c compiler exited 1
Tue Oct  6 21:30:26 2026 ===  0.012184 === uint32/useint32 compiling gcc -fPIC -Wall -fomit-frame-pointer -fwrapv -O3
Tue Oct  6 21:30:26 2026 ===  0.000759 === uint32/useint32/sort.c compiling
Tue Oct  6 21:30:26 2026 ===  0.157743 === uint32/useint32/compiler.c compiling
Tue Oct  6 21:30:26 2026 ===  0.087137 === uint32/useint32/version.c compiling
Tue Oct  6 21:30:26 2026 ===  0.085546 === uint32/useint32/implementation.c compiling
Tue Oct  6 21:30:26 2026 ===  0.082128 === uint32/useint32/cycles.c compiling
Tue Oct  6 21:30:27 2026 ===  0.288493 === uint32/useint32/works.c compiling
Tue Oct  6 21:30:27 2026 ===  0.274172 === uint32/useint32 compiled gcc -fPIC -Wall -fomit-frame-pointer -fwrapv -O3
Tue Oct  6 21:30:27 2026 ===  0.055784 === uint32/useint32 compiling gcc -fPIC -Wall -fomit-frame-pointer -fwrapv -march=core-avx2 -O3
Tue Oct  6 21:30:27 2026 ===  0.000868 === uint32/useint32/sort.c compiling
Tue Oct  6 21:30:27 2026 ===  0.039466 === output
> cc1: error: unknown value ‘core-avx2’ for ‘-march’
> cc1: note: valid arguments are: armv8-a armv8.1-a armv8.2-a armv8.3-a armv8.4-a armv8.5-a armv8.6-a armv8.7-a armv8.8-a armv8-r armv9-a native
Tue Oct  6 21:30:27 2026 ===  0.002907 === uint32/useint32/sort.c compiler exited 1
Tue Oct  6 21:30:27 2026 ===  0.000203 === uint32/useint32/compiler.c compiling
Tue Oct  6 21:30:27 2026 ===  0.041616 === output
> cc1: error: unknown value ‘core-avx2’ for ‘-march’
> cc1: note: valid arguments are: armv8-a armv8.1-a armv8.2-a armv8.3-a armv8.4-a armv8.5-a armv8.6-a armv8.7-a armv8.8-a armv8-r armv9-a native
Tue Oct  6 21:30:27 2026 ===  0.001367 === uint32/useint32/compiler.c compiler exited 1
Tue Oct  6 21:30:27 2026 ===  0.000208 === uint32/useint32/version.c compiling
Tue Oct  6 21:30:27 2026 ===  0.039426 === output
> cc1: error: unknown value ‘core-avx2’ for ‘-march’
> cc1: note: valid arguments are: armv8-a armv8.1-a armv8.2-a armv8.3-a armv8.4-a armv8.5-a armv8.6-a armv8.7-a armv8.8-a armv8-r armv9-a native
Tue Oct  6 21:30:27 2026 ===  0.001277 === uint32/useint32/version.c compiler exited 1
Tue Oct  6 21:30:27 2026 ===  0.000205 === uint32/useint32/implementation.c compiling
Tue Oct  6 21:30:27 2026 ===  0.059011 === output
> cc1: error: unknown value ‘core-avx2’ for ‘-march’
> cc1: note: valid arguments are: armv8-a armv8.1-a armv8.2-a armv8.3-a armv8.4-a armv8.5-a armv8.6-a armv8.7-a armv8.8-a armv8-r armv9-a native
Tue Oct  6 21:30:27 2026 ===  0.001091 === uint32/useint32/implementation.c compiler exited 1
Tue Oct  6 21:30:27 2026 ===  0.000188 === uint32/useint32/cycles.c compiling
Tue Oct  6 21:30:27 2026 ===  0.061855 === output
> cc1: error: unknown value ‘core-avx2’ for ‘-march’
> cc1: note: valid arguments are: armv8-a armv8.1-a armv8.2-a armv8.3-a armv8.4-a armv8.5-a armv8.6-a armv8.7-a armv8.8-a armv8-r armv9-a native
Tue Oct  6 21:30:27 2026 ===  0.001485 === uint32/useint32/cycles.c compiler exited 1
Tue Oct  6 21:30:27 2026 ===  0.000201 === uint32/useint32/works.c compiling
Tue Oct  6 21:30:27 2026 ===  0.064898 === output
> cc1: error: unknown value ‘core-avx2’ for ‘-march’
> cc1: note: valid arguments are: armv8-a armv8.1-a armv8.2-a armv8.3-a armv8.4-a armv8.5-a armv8.6-a armv8.7-a armv8.8-a armv8-r armv9-a native
Tue Oct  6 21:30:27 2026 ===  0.001159 === uint32/useint32/works.c compiler exited 1
Tue Oct  6 21:30:27 2026 ===  0.000251 === uint32/useint32 compiling clang -fPIC -Wall -fomit-frame-pointer -fwrapv -Qunused-arguments -O3
Tue Oct  6 21:30:27 2026 ===  0.000740 === uint32/useint32/sort.c compiling
Tue Oct  6 21:30:27 2026 ===  0.034867 === output
> gcc: error: unrecognized command-line option ‘-Qunused-arguments’
Tue Oct  6 21:30:27 2026 ===  0.002524 === uint32/useint32/sort.c compiler exited 1
Tue Oct  6 21:30:27 2026 ===  0.000224 === uint32/useint32/compiler.c compiling
Tue Oct  6 21:30:27 2026 ===  0.034811 === output
> gcc: error: unrecognized command-line option ‘-Qunused-arguments’
Tue Oct  6 21:30:27 2026 ===  0.001098 === uint32/useint32/compiler.c compiler exited 1
Tue Oct  6 21:30:27 2026 ===  0.000174 === uint32/useint32/version.c compiling
Tue Oct  6 21:30:27 2026 ===  0.033779 === output
> gcc: error: unrecognized command-line option ‘-Qunused-arguments’
Tue Oct  6 21:30:27 2026 ===  0.001125 === uint32/useint32/version.c compiler exited 1
Tue Oct  6 21:30:27 2026 ===  0.000193 === uint32/useint32/implementation.c compiling
Tue Oct  6 21:30:27 2026 ===  0.036169 === output
> gcc: error: unrecognized command-line option ‘-Qunused-arguments’
Tue Oct  6 21:30:27 2026 ===  0.001078 === uint32/useint32/implementation.c compiler exited 1
Tue Oct  6 21:30:27 2026 ===  0.000216 === uint32/useint32/cycles.c compiling
Tue Oct  6 21:30:27 2026 ===  0.034344 === output
> gcc: error: unrecognized command-line option ‘-Qunused-arguments’
Tue Oct  6 21:30:27 2026 ===  0.001335 === uint32/useint32/cycles.c compiler exited 1
Tue Oct  6 21:30:27 2026 ===  0.000207 === uint32/useint32/works.c compiling
Tue Oct  6 21:30:27 2026 ===  0.035752 === output
> gcc: error: unrecognized command-line option ‘-Qunused-arguments’
Tue Oct  6 21:30:27 2026 ===  0.001144 === uint32/useint32/works.c compiler exited 1
Tue Oct  6 21:30:27 2026 ===  0.000251 === uint32/useint32 compiling clang -fPIC -Wall -fomit-frame-pointer -fwrapv -Qunused-arguments -mavx2 -O3
Tue Oct  6 21:30:27 2026 ===  0.000728 === uint32/useint32/sort.c compiling
Tue Oct  6 21:30:27 2026 ===  0.034823 === output
> gcc: error: unrecognized command-line option ‘-Qunused-arguments’
> gcc: error: unrecognized command-line option ‘-mavx2’
Tue Oct  6 21:30:27 2026 ===  0.002703 === uint32/useint32/sort.c compiler exited 1
Tue Oct  6 21:30:27 2026 ===  0.000223 === uint32/useint32/compiler.c compiling
Tue Oct  6 21:30:28 2026 ===  0.036923 === output
> gcc: error: unrecognized command-line option ‘-Qunused-arguments’
> gcc: error: unrecognized command-line option ‘-mavx2’
Tue Oct  6 21:30:28 2026 ===  0.001266 === uint32/useint32/compiler.c compiler exited 1
Tue Oct  6 21:30:28 2026 ===  0.000220 === uint32/useint32/version.c compiling
Tue Oct  6 21:30:28 2026 ===  0.036453 === output
> gcc: error: unrecognized command-line option ‘-Qunused-arguments’
> gcc: error: unrecognized command-line option ‘-mavx2’
Tue Oct  6 21:30:28 2026 ===  0.001049 === uint32/useint32/version.c compiler exited 1
Tue Oct  6 21:30:28 2026 ===  0.000180 === uint32/useint32/implementation.c compiling
Tue Oct  6 21:30:28 2026 ===  0.036037 === output
> gcc: error: unrecognized command-line option ‘-Qunused-arguments’
> gcc: error: unrecognized command-line option ‘-mavx2’
Tue Oct  6 21:30:28 2026 ===  0.001085 === uint32/useint32/implementation.c compiler exited 1
Tue Oct  6 21:30:28 2026 ===  0.000201 === uint32/useint32/cycles.c compiling
Tue Oct  6 21:30:28 2026 ===  0.037128 === output
> gcc: error: unrecognized command-line option ‘-Qunused-arguments’
> gcc: error: unrecognized command-line option ‘-mavx2’
Tue Oct  6 21:30:28 2026 ===  0.001133 === uint32/useint32/cycles.c compiler exited 1
Tue Oct  6 21:30:28 2026 ===  0.000201 === uint32/useint32/works.c compiling
Tue Oct  6 21:30:28 2026 ===  0.051779 === output
> gcc: error: unrecognized command-line option ‘-Qunused-arguments’
> gcc: error: unrecognized command-line option ‘-mavx2’
Tue Oct  6 21:30:28 2026 ===  0.001135 === uint32/useint32/works.c compiler exited 1
Tue Oct  6 21:30:28 2026 ===  0.011344 === float32/useint32 compiling gcc -fPIC -Wall -fomit-frame-pointer -fwrapv -O3
Tue Oct  6 21:30:28 2026 ===  0.000790 === float32/useint32/sort.c compiling
Tue Oct  6 21:30:28 2026 ===  0.149633 === float32/useint32/compiler.c compiling
Tue Oct  6 21:30:28 2026 ===  0.077896 === float32/useint32/version.c compiling
Tue Oct  6 21:30:28 2026 ===  0.077935 === float32/useint32/implementation.c compiling
Tue Oct  6 21:30:28 2026 ===  0.074752 === float32/useint32/cycles.c compiling
Tue Oct  6 21:30:28 2026 ===  0.291505 === float32/useint32/works.c compiling
Tue Oct  6 21:30:29 2026 ===  0.278884 === float32/useint32 compiled gcc -fPIC -Wall -fomit-frame-pointer -fwrapv -O3
Tue Oct  6 21:30:29 2026 ===  0.055378 === float32/useint32 compiling gcc -fPIC -Wall -fomit-frame-pointer -fwrapv -march=core-avx2 -O3
Tue Oct  6 21:30:29 2026 ===  0.000777 === float32/useint32/sort.c compiling
Tue Oct  6 21:30:29 2026 ===  0.041100 === output
> cc1: error: unknown value ‘core-avx2’ for ‘-march’
> cc1: note: valid arguments are: armv8-a armv8.1-a armv8.2-a armv8.3-a armv8.4-a armv8.5-a armv8.6-a armv8.7-a armv8.8-a armv8-r armv9-a native
Tue Oct  6 21:30:29 2026 ===  0.002641 === float32/useint32/sort.c compiler exited 1
Tue Oct  6 21:30:29 2026 ===  0.000231 === float32/useint32/compiler.c compiling
Tue Oct  6 21:30:29 2026 ===  0.042362 === output
> cc1: error: unknown value ‘core-avx2’ for ‘-march’
> cc1: note: valid arguments are: armv8-a armv8.1-a armv8.2-a armv8.3-a armv8.4-a armv8.5-a armv8.6-a armv8.7-a armv8.8-a armv8-r armv9-a native
Tue Oct  6 21:30:29 2026 ===  0.001261 === float32/useint32/compiler.c compiler exited 1
Tue Oct  6 21:30:29 2026 ===  0.000194 === float32/useint32/version.c compiling
Tue Oct  6 21:30:29 2026 ===  0.038877 === output
> cc1: error: unknown value ‘core-avx2’ for ‘-march’
> cc1: note: valid arguments are: armv8-a armv8.1-a armv8.2-a armv8.3-a armv8.4-a armv8.5-a armv8.6-a armv8.7-a armv8.8-a armv8-r armv9-a native
Tue Oct  6 21:30:29 2026 ===  0.001208 === float32/useint32/version.c compiler exited 1
Tue Oct  6 21:30:29 2026 ===  0.000198 === float32/useint32/implementation.c compiling
Tue Oct  6 21:30:29 2026 ===  0.042165 === output
> cc1: error: unknown value ‘core-avx2’ for ‘-march’
> cc1: note: valid arguments are: armv8-a armv8.1-a armv8.2-a armv8.3-a armv8.4-a armv8.5-a armv8.6-a armv8.7-a armv8.8-a armv8-r armv9-a native
Tue Oct  6 21:30:29 2026 ===  0.001150 === float32/useint32/implementation.c compiler exited 1
Tue Oct  6 21:30:29 2026 ===  0.000189 === float32/useint32/cycles.c compiling
Tue Oct  6 21:30:29 2026 ===  0.039462 === output
> cc1: error: unknown value ‘core-avx2’ for ‘-march’
> cc1: note: valid arguments are: armv8-a armv8.1-a armv8.2-a armv8.3-a armv8.4-a armv8.5-a armv8.6-a armv8.7-a armv8.8-a armv8-r armv9-a native
Tue Oct  6 21:30:29 2026 ===  0.001109 === float32/useint32/cycles.c compiler exited 1
Tue Oct  6 21:30:29 2026 ===  0.000191 === float32/useint32/works.c compiling
Tue Oct  6 21:30:29 2026 ===  0.042437 === output
> cc1: error: unknown value ‘core-avx2’ for ‘-march’
> cc1: note: valid arguments are: armv8-a armv8.1-a armv8.2-a armv8.3-a armv8.4-a armv8.5-a armv8.6-a armv8.7-a armv8.8-a armv8-r armv9-a native
Tue Oct  6 21:30:29 2026 ===  0.001248 === float32/useint32/works.c compiler exited 1
Tue Oct  6 21:30:29 2026 ===  0.000266 === float32/useint32 compiling clang -fPIC -Wall -fomit-frame-pointer -fwrapv -Qunused-arguments -O3
Tue Oct  6 21:30:29 2026 ===  0.000744 === float32/useint32/sort.c compiling
Tue Oct  6 21:30:29 2026 ===  0.036421 === output
> gcc: error: unrecognized command-line option ‘-Qunused-arguments’
Tue Oct  6 21:30:29 2026 ===  0.002495 === float32/useint32/sort.c compiler exited 1
Tue Oct  6 21:30:29 2026 ===  0.000217 === float32/useint32/compiler.c compiling
Tue Oct  6 21:30:29 2026 ===  0.035803 === output
> gcc: error: unrecognized command-line option ‘-Qunused-arguments’
Tue Oct  6 21:30:29 2026 ===  0.001181 === float32/useint32/compiler.c compiler exited 1
Tue Oct  6 21:30:29 2026 ===  0.000247 === float32/useint32/version.c compiling
Tue Oct  6 21:30:29 2026 ===  0.046070 === output
> gcc: error: unrecognized command-line option ‘-Qunused-arguments’
Tue Oct  6 21:30:29 2026 ===  0.001072 === float32/useint32/version.c compiler exited 1
Tue Oct  6 21:30:29 2026 ===  0.000199 === float32/useint32/implementation.c compiling
Tue Oct  6 21:30:29 2026 ===  0.040833 === output
> gcc: error: unrecognized command-line option ‘-Qunused-arguments’
Tue Oct  6 21:30:29 2026 ===  0.001264 === float32/useint32/implementation.c compiler exited 1
Tue Oct  6 21:30:29 2026 ===  0.000219 === float32/useint32/cycles.c compiling
Tue Oct  6 21:30:29 2026 ===  0.038649 === output
> gcc: error: unrecognized command-line option ‘-Qunused-arguments’
Tue Oct  6 21:30:29 2026 ===  0.001010 === float32/useint32/cycles.c compiler exited 1
Tue Oct  6 21:30:29 2026 ===  0.000207 === float32/useint32/works.c compiling
Tue Oct  6 21:30:29 2026 ===  0.040764 === output
> gcc: error: unrecognized command-line option ‘-Qunused-arguments’
Tue Oct  6 21:30:29 2026 ===  0.001157 === float32/useint32/works.c compiler exited 1
Tue Oct  6 21:30:29 2026 ===  0.000258 === float32/useint32 compiling clang -fPIC -Wall -fomit-frame-pointer -fwrapv -Qunused-arguments -mavx2 -O3
Tue Oct  6 21:30:29 2026 ===  0.000747 === float32/useint32/sort.c compiling
Tue Oct  6 21:30:29 2026 ===  0.038867 === output
> gcc: error: unrecognized command-line option ‘-Qunused-arguments’
> gcc: error: unrecognized command-line option ‘-mavx2’
Tue Oct  6 21:30:29 2026 ===  0.002682 === float32/useint32/sort.c compiler exited 1
Tue Oct  6 21:30:29 2026 ===  0.000199 === float32/useint32/compiler.c compiling
Tue Oct  6 21:30:29 2026 ===  0.037839 === output
> gcc: error: unrecognized command-line option ‘-Qunused-arguments’
> gcc: error: unrecognized command-line option ‘-mavx2’
Tue Oct  6 21:30:29 2026 ===  0.001058 === float32/useint32/compiler.c compiler exited 1
Tue Oct  6 21:30:29 2026 ===  0.000178 === float32/useint32/version.c compiling
Tue Oct  6 21:30:29 2026 ===  0.037254 === output
> gcc: error: unrecognized command-line option ‘-Qunused-arguments’
> gcc: error: unrecognized command-line option ‘-mavx2’
Tue Oct  6 21:30:29 2026 ===  0.001068 === float32/useint32/version.c compiler exited 1
Tue Oct  6 21:30:29 2026 ===  0.000184 === float32/useint32/implementation.c compiling
Tue Oct  6 21:30:29 2026 ===  0.037422 === output
> gcc: error: unrecognized command-line option ‘-Qunused-arguments’
> gcc: error: unrecognized command-line option ‘-mavx2’
Tue Oct  6 21:30:29 2026 ===  0.001126 === float32/useint32/implementation.c compiler exited 1
Tue Oct  6 21:30:29 2026 ===  0.000204 === float32/useint32/cycles.c compiling
Tue Oct  6 21:30:29 2026 ===  0.060105 === output
> gcc: error: unrecognized command-line option ‘-Qunused-arguments’
> gcc: error: unrecognized command-line option ‘-mavx2’
Tue Oct  6 21:30:29 2026 ===  0.001199 === float32/useint32/cycles.c compiler exited 1
Tue Oct  6 21:30:29 2026 ===  0.000222 === float32/useint32/works.c compiling
Tue Oct  6 21:30:29 2026 ===  0.037549 === output
> gcc: error: unrecognized command-line option ‘-Qunused-arguments’
> gcc: error: unrecognized command-line option ‘-mavx2’
Tue Oct  6 21:30:29 2026 ===  0.001721 === float32/useint32/works.c compiler exited 1
Tue Oct  6 21:30:29 2026 ===  0.000291 === command/limits.c compiling gcc -fPIC -Wall -fomit-frame-pointer -fwrapv -O3
Tue Oct  6 21:30:30 2026 ===  0.138637 === command/limits.c compiling gcc -fPIC -Wall -fomit-frame-pointer -fwrapv -march=core-avx2 -O3
Tue Oct  6 21:30:30 2026 ===  0.051082 === output
> cc1: error: unknown value ‘core-avx2’ for ‘-march’
> cc1: note: valid arguments are: armv8-a armv8.1-a armv8.2-a armv8.3-a armv8.4-a armv8.5-a armv8.6-a armv8.7-a armv8.8-a armv8-r armv9-a native
Tue Oct  6 21:30:30 2026 ===  0.001826 === command/limits.c compiler exited 1
Tue Oct  6 21:30:30 2026 ===  0.000212 === command/limits.c compiling clang -fPIC -Wall -fomit-frame-pointer -fwrapv -Qunused-arguments -O3
Tue Oct  6 21:30:30 2026 ===  0.040764 === output
> gcc: error: unrecognized command-line option ‘-Qunused-arguments’
Tue Oct  6 21:30:30 2026 ===  0.001908 === command/limits.c compiler exited 1
Tue Oct  6 21:30:30 2026 ===  0.000212 === command/limits.c compiling clang -fPIC -Wall -fomit-frame-pointer -fwrapv -Qunused-arguments -mavx2 -O3
Tue Oct  6 21:30:30 2026 ===  0.039741 === output
> gcc: error: unrecognized command-line option ‘-Qunused-arguments’
> gcc: error: unrecognized command-line option ‘-mavx2’
Tue Oct  6 21:30:30 2026 ===  0.001731 === command/limits.c compiler exited 1
Tue Oct  6 21:30:30 2026 ===  0.004233 === command/int32-speed.c compiling gcc -fPIC -Wall -fomit-frame-pointer -fwrapv -O3
Tue Oct  6 21:30:30 2026 ===  0.254802 === command/int32-speed.c compiling gcc -fPIC -Wall -fomit-frame-pointer -fwrapv -march=core-avx2 -O3
Tue Oct  6 21:30:30 2026 ===  0.038776 === output
> cc1: error: unknown value ‘core-avx2’ for ‘-march’
> cc1: note: valid arguments are: armv8-a armv8.1-a armv8.2-a armv8.3-a armv8.4-a armv8.5-a armv8.6-a armv8.7-a armv8.8-a armv8-r armv9-a native
Tue Oct  6 21:30:30 2026 ===  0.001388 === command/int32-speed.c compiler exited 1
Tue Oct  6 21:30:30 2026 ===  0.000192 === command/int32-speed.c compiling clang -fPIC -Wall -fomit-frame-pointer -fwrapv -Qunused-arguments -O3
Tue Oct  6 21:30:30 2026 ===  0.034220 === output
> gcc: error: unrecognized command-line option ‘-Qunused-arguments’
Tue Oct  6 21:30:30 2026 ===  0.001209 === command/int32-speed.c compiler exited 1
Tue Oct  6 21:30:30 2026 ===  0.000189 === command/int32-speed.c compiling clang -fPIC -Wall -fomit-frame-pointer -fwrapv -Qunused-arguments -mavx2 -O3
Tue Oct  6 21:30:30 2026 ===  0.036206 === output
> gcc: error: unrecognized command-line option ‘-Qunused-arguments’
> gcc: error: unrecognized command-line option ‘-mavx2’
Tue Oct  6 21:30:30 2026 ===  0.001394 === command/int32-speed.c compiler exited 1
Tue Oct  6 21:30:30 2026 ===  0.005498 === command/uint32-speed.c compiling gcc -fPIC -Wall -fomit-frame-pointer -fwrapv -O3
Tue Oct  6 21:30:30 2026 ===  0.242850 === command/uint32-speed.c compiling gcc -fPIC -Wall -fomit-frame-pointer -fwrapv -march=core-avx2 -O3
Tue Oct  6 21:30:30 2026 ===  0.040897 === output
> cc1: error: unknown value ‘core-avx2’ for ‘-march’
> cc1: note: valid arguments are: armv8-a armv8.1-a armv8.2-a armv8.3-a armv8.4-a armv8.5-a armv8.6-a armv8.7-a armv8.8-a armv8-r armv9-a native
Tue Oct  6 21:30:30 2026 ===  0.001208 === command/uint32-speed.c compiler exited 1
Tue Oct  6 21:30:30 2026 ===  0.000181 === command/uint32-speed.c compiling clang -fPIC -Wall -fomit-frame-pointer -fwrapv -Qunused-arguments -O3
Tue Oct  6 21:30:30 2026 ===  0.035159 === output
> gcc: error: unrecognized command-line option ‘-Qunused-arguments’
Tue Oct  6 21:30:30 2026 ===  0.001124 === command/uint32-speed.c compiler exited 1
Tue Oct  6 21:30:30 2026 ===  0.000190 === command/uint32-speed.c compiling clang -fPIC -Wall -fomit-frame-pointer -fwrapv -Qunused-arguments -mavx2 -O3
Tue Oct  6 21:30:30 2026 ===  0.045402 === output
> gcc: error: unrecognized command-line option ‘-Qunused-arguments’
> gcc: error: unrecognized command-line option ‘-mavx2’
Tue Oct  6 21:30:30 2026 ===  0.001096 === command/uint32-speed.c compiler exited 1
Tue Oct  6 21:30:30 2026 ===  0.004517 === command/float32-speed.c compiling gcc -fPIC -Wall -fomit-frame-pointer -fwrapv -O3
Tue Oct  6 21:30:31 2026 ===  0.244174 === command/float32-speed.c compiling gcc -fPIC -Wall -fomit-frame-pointer -fwrapv -march=core-avx2 -O3
Tue Oct  6 21:30:31 2026 ===  0.053364 === output
> cc1: error: unknown value ‘core-avx2’ for ‘-march’
> cc1: note: valid arguments are: armv8-a armv8.1-a armv8.2-a armv8.3-a armv8.4-a armv8.5-a armv8.6-a armv8.7-a armv8.8-a armv8-r armv9-a native
Tue Oct  6 21:30:31 2026 ===  0.001230 === command/float32-speed.c compiler exited 1
Tue Oct  6 21:30:31 2026 ===  0.000211 === command/float32-speed.c compiling clang -fPIC -Wall -fomit-frame-pointer -fwrapv -Qunused-arguments -O3
Tue Oct  6 21:30:31 2026 ===  0.035284 === output
> gcc: error: unrecognized command-line option ‘-Qunused-arguments’
Tue Oct  6 21:30:31 2026 ===  0.001273 === command/float32-speed.c compiler exited 1
Tue Oct  6 21:30:31 2026 ===  0.000228 === command/float32-speed.c compiling clang -fPIC -Wall -fomit-frame-pointer -fwrapv -Qunused-arguments -mavx2 -O3
Tue Oct  6 21:30:31 2026 ===  0.035544 === output
> gcc: error: unrecognized command-line option ‘-Qunused-arguments’
> gcc: error: unrecognized command-line option ‘-mavx2’
Tue Oct  6 21:30:31 2026 ===  0.001704 === command/float32-speed.c compiler exited 1
Tue Oct  6 21:30:31 2026 ===  0.001995 === build finishing successfully
